Package Details: perl-wx 0.9932-2

Git Clone URL: https://aur.archlinux.org/perl-wx.git (read-only)
Package Base: perl-wx
Description: Wx - interface to the wxWidgets GUI toolkit
Upstream URL: http://search.cpan.org/dist/Wx
Licenses: GPL, PerlArtistic
Provides: perl-build-wx-xsp-enum, perl-build-wx-xsp-event, perl-build-wx-xsp-overload, perl-build-wx-xsp-virtual, perl-wx-app, perl-wx-artprovider, perl-wx-aui, perl-wx-build-makemaker, perl-wx-build-makemaker-any_os, perl-wx-build-makemaker-any_wx_config, perl-wx-build-makemaker-core, perl-wx-build-makemaker-hacks, perl-wx-build-makemaker-macosx_gcc, perl-wx-build-makemaker-win32, perl-wx-build-makemaker-win32_mingw, perl-wx-build-makemaker-win32_msvc, perl-wx-build-options, perl-wx-build-utils, perl-wx-calendar, perl-wx-dataview, perl-wx-datetime, perl-wx-dnd, perl-wx-docview, perl-wx-dropsource, perl-wx-event, perl-wx-fs, perl-wx-grid, perl-wx-help, perl-wx-html, perl-wx-ipc, perl-wx-locale, perl-wx-mdi, perl-wx-media, perl-wx-menu, perl-wx-mini, perl-wx-overload-driver, perl-wx-overload-handle, perl-wx-perl-carp, perl-wx-perl-splashfast, perl-wx-perl-textvalidator, perl-wx-perltest, perl-wx-print, perl-wx-propertygrid, perl-wx-radiobox, perl-wx-ribbon, perl-wx-richtext, perl-wx-socket, perl-wx-stc, perl-wx-timer, perl-wx-webview, perl-wx-xrc
Submitter: None
Maintainer: dracorp
Last Packager: dracorp
Votes: 60
Popularity: 0.002629
First Submitted: 2007-09-20 07:29
Last Updated: 2017-12-28 11:46

Latest Comments

1 2 3 4 5 6 ... Next › Last »

dracorp commented on 2018-02-01 18:56

@ibrokemypie You have something missing and why are you using gcc 3.4?

% gcc --version
gcc (GCC) 7.2.1 20180116

ibrokemypie commented on 2018-01-31 13:48

i was able to fix this by running export CC=clang, export CXX=clang++ and replacing perl Makefile.PL in the pkgbuild with perl Makefile.pl --extra-cflags=-std=c++11

ibrokemypie commented on 2018-01-31 13:38

currently failing to build at all for me

==> Making package: perl-wx 0.9932-2 (Thu Feb  1 00:37:51 AEDT 2018)
==> Checking runtime dependencies...
==> Checking buildtime dependencies...
==> Retrieving sources...
  -> Found Wx-0.9932.tar.gz
==> Validating source files with sha256sums...
    Wx-0.9932.tar.gz ... Passed
==> Removing existing $srcdir/ directory...
==> Extracting sources...
  -> Extracting Wx-0.9932.tar.gz with bsdtar
==> Removing existing $pkgdir/ directory...
==> Starting build()...
Searching configuration for:
wxWidgets (any version) for (any toolkit); compiler compatibility: gcc 3.4; 

Available configurations:
wxWidgets 3.000003 for gtk2; compiler compatibility: nc 0; options: no debug, unicode, no mslu
Compilation failed in require at Makefile.PL line 21.
BEGIN failed--compilation aborted at Makefile.PL line 21.
==> ERROR: A failure occurred in build().
    Aborting...

dracorp commented on 2017-12-28 11:53

@christianlupus: fixed, thx

dracorp commented on 2017-12-28 10:14

webkit2gtk vs webkitgtk2

christianlupus commented on 2017-12-27 16:49

I just found an eror in the PKGBUILD file. The package is called webkit2gtk instead of webkitgtk2 in line 26.

dracorp commented on 2017-06-13 18:47

I think there is a problem with compilation order. I'd had similar problem with perl-math-prime-util but after recompilation of perl-math-prime-util-gmp everything is OK.
But perl-wx depends from 'any' perl packages.

I've recompiled all binary perl packages, maybe you should also try? Three times...
One more thing, there are new versions(release) of wxgtk2 and wxgtk-common

plushvoxel commented on 2017-06-12 22:14

ok, was impatient.
i had to wait for the update of wx...

ingod commented on 2017-06-12 17:55

.
.
t/01_load.t ......... ok
t/02_inheritance.t .. ok
t/03_threads.t ...... threads.c: loadable library and perl binaries are mismatched (got handshake key 0xdb80080, needed 0xde00080)
t/03_threads.t ...... Dubious, test returned 1 (wstat 256, 0x100)
No subtests run

Test Summary Report
-------------------
t/03_threads.t (Wstat: 256 Tests: 0 Failed: 0)
Non-zero exit status: 1
Parse errors: No plan found in TAP output
Files=3, Tests=5, 1 wallclock secs ( 0.02 usr 0.00 sys + 0.16 cusr 0.01 csys = 0.19 CPU)
Result: FAIL
Failed 1/3 test programs. 0/5 subtests failed.
make[2]: *** [Makefile:760: test_dynamic] Fehler 1
make[2]: Verzeichnis „/tmp/yaourt-tmp-dreamman/aur-perl-wx/src/Wx-0.9932/ext/calendar“ wird verlassen
make[1]: *** [Makefile:776: subdirs-test_dynamic] Fehler 2
make[1]: Verzeichnis „/tmp/yaourt-tmp-dreamman/aur-perl-wx/src/Wx-0.9932/ext“ wird verlassen
make: *** [Makefile:1253: subdirs-test_dynamic] Fehler 2

plushvoxel commented on 2017-06-12 17:06

Test Summary Report
-------------------
t/01_load.t (Wstat: 139 Tests: 0 Failed: 0)
Non-zero wait status: 139
Parse errors: Bad plan. You planned 1 tests but ran 0.
t/02_inheritance.t (Wstat: 139 Tests: 0 Failed: 0)
Non-zero wait status: 139
Parse errors: No plan found in TAP output
t/03_threads.t (Wstat: 139 Tests: 0 Failed: 0)
Non-zero wait status: 139
Parse errors: Bad plan. You planned 4 tests but ran 0.
Files=3, Tests=0, 0 wallclock secs ( 0.03 usr 0.00 sys + 0.39 cusr 0.09 csys = 0.51 CPU)
Result: FAIL
Failed 3/3 test programs. 0/0 subtests failed.
make[2]: *** [Makefile:760: test_dynamic] Error 255
make[2]: Leaving directory '/home/marble/tmp/yaourt/yaourt-tmp-marble/aur-perl-wx/src/Wx-0.9932/ext/webview'
make[1]: *** [Makefile:790: subdirs-test_dynamic] Error 2
make[1]: Leaving directory '/home/marble/tmp/yaourt/yaourt-tmp-marble/aur-perl-wx/src/Wx-0.9932/ext'
make: *** [Makefile:1253: subdirs-test_dynamic] Error 2