Package Details: pcl 1.10.0-1

Git Clone URL: https://aur.archlinux.org/pcl.git (read-only, click to copy)
Package Base: pcl
Description: A comprehensive open source library for n-D Point Clouds and 3D geometry processing
Upstream URL: http://www.pointclouds.org
Licenses: BSD
Submitter: None
Maintainer: majorx234
Last Packager: majorx234
Votes: 41
Popularity: 0.38
First Submitted: 2011-04-05 03:39
Last Updated: 2020-03-08 12:13

Sources (1)

stepo commented on 2013-04-18 07:03

Hi,
I get this boost-related compilation error:

/usr/include/boost/smart_ptr/shared_array.hpp:48:25: note: no known conversion for argument 1 from ‘int’ to ‘const boost::shared_array<short unsigned int>&’
make[2]: *** [io/CMakeFiles/pcl_io.dir/src/openni_grabber.cpp.o] Error 1
make[1]: *** [io/CMakeFiles/pcl_io.dir/all] Error 2
make: *** [all] Error 2

dtouch3d commented on 2013-02-15 14:24

The URL doesn't work anymore. Replace with
http://sourceforge.net/projects/pointclouds/files/$pkgver/PCL-$pkgver-Source.tar.bz2/download

Svenstaro commented on 2012-08-08 12:36

Updated.

Anonymous comment on 2012-08-08 08:55

1.6.0 works well. Simply alter the version number, the md5sum and comment out the "find | xargs..." lines (and the -DBUILD_CUDA).

vivasvan commented on 2012-06-23 18:28

hi, while compiling the above package i am getting the same error as Theodore describes.
is something missing in the pkgbuild?

any help would be highly appreciated.

Also, when i tried pcl-svn i get the following error

CMake Error: The following variables are used in this project, but they are set to NOTFOUND.
Please set them or make sure they are set and tested correctly in the CMake files:
MPI_CXX_LIBRARIES (ADVANCED)
linked by target "proctor" in directory /home/pankaj/tmp/yaourt-tmp-pankaj/aur-pcl-svn/src/pcl/proctor
-- Configuring incomplete, errors occurred!
==> ERROR: A failure occurred in build().
Aborting...

Svenstaro commented on 2012-06-19 12:35

Why didn't you use pcl-svn then?

theodore commented on 2012-06-19 11:01

finally i managed to compile the source from the trunk

http://pointclouds.org/downloads/source.html

by modifying a little bit the PKGBUILD

thanks

theodore commented on 2012-06-19 01:38

hi i am trying to compile the package but i am getting the following error:

==> Starting build()...
sed: no input files
==> ERROR: A failure occurred in build().
Aborting...

then i am removing the two lines inside the PKGBUILD that contain the "sed" command since there is no input, but the compilation ends with the following error:

make[2]: *** [tracking/CMakeFiles/pcl_tracking.dir/src/particle_filter_omp.cpp.o] Error 1
make[2]: *** Waiting for unfinished jobs....
Scanning dependencies of target openni_change_viewer
[ 75%] Building CXX object apps/CMakeFiles/openni_change_viewer.dir/src/openni_change_viewer.cpp.o
Scanning dependencies of target openni_passthrough
[ 75%] Building CXX object apps/CMakeFiles/openni_passthrough.dir/src/openni_passthrough.cpp.o
make[1]: *** [tracking/CMakeFiles/pcl_tracking.dir/all] Error 2
make[1]: *** Waiting for unfinished jobs....
Linking CXX executable ../bin/openni_change_viewer
[ 75%] Built target openni_change_viewer
Linking CXX executable ../bin/openni_passthrough
[ 75%] Built target openni_passthrough
Linking CXX shared library ../lib/libpcl_features.so
[ 75%] Built target pcl_features
make: *** [all] Error 2
==> ERROR: A failure occurred in build().
Aborting...

any idea
thanks in advance

theodore commented on 2012-06-19 01:09

please remove from the PKGBUILD the two lines with the "find" and "sed" commands.

Svenstaro commented on 2012-03-28 13:51

Update deps to flann as libflann is gone.