Package Details: paper-icon-theme-git 805.8c7bf8d2-1

Git Clone URL: (read-only, click to copy)
Package Base: paper-icon-theme-git
Description: Paper is an icon theme for GTK based desktops and fits perfectly the paper-gtk-theme
Upstream URL:
Keywords: icon theme
Licenses: CC BY-SA 4.0
Provides: paper-icon-theme
Submitter: gaelic
Maintainer: gaelic
Last Packager: gaelic
Votes: 216
Popularity: 0.56
First Submitted: 2015-01-29 08:26
Last Updated: 2019-02-19 13:00

Required by (2)

Sources (1)

Latest Comments

1 2 3 4 Next › Last »

cknoblauch commented on 2020-04-28 18:17

I tried to apply the patch supplied by @mydongistiny, it fails with the latest HEAD (aa3e8af) of source repo:

patching file Paper/scalable/actions/document-open-symbolic.svg
Hunk #1 FAILED at 1.
1 out of 1 hunk FAILED -- saving rejects to file Paper/scalable/actions/document-open-symbolic.svg.rej
patching file Paper/scalable/actions/edit-redo-symbolic.svg
Hunk #1 FAILED at 1.
1 out of 1 hunk FAILED -- saving rejects to file Paper/scalable/actions/edit-redo-symbolic.svg.rej
patching file Paper/scalable/actions/edit-undo-symbolic.svg
Hunk #1 FAILED at 1.
1 out of 1 hunk FAILED -- saving rejects to file Paper/scalable/actions/edit-undo-symbolic.svg.rej
patching file Paper/scalable/actions/format-text-bold-symbolic.svg
Hunk #1 FAILED at 1.
1 out of 1 hunk FAILED -- saving rejects to file Paper/scalable/actions/format-text-bold-symbolic.svg.rej
can't find file to patch at input line 145
Perhaps you used the wrong -p or --strip option?
The text leading up to this was:
|diff --git a/Paper/scalable/actions/format-text-direction-ltr-symbolic.svg b/Paper/scalable/actions/format-text-direction-ltr-symbolic.svg
|index 54c210ca..7ba03e21 100644
|--- a/Paper/scalable/actions/format-text-direction-ltr-symbolic.svg
|+++ b/Paper/scalable/actions/format-text-direction-ltr-symbolic.svg

txtsd commented on 2020-03-12 13:33

Upstream fixed the broken icons.

Magbed commented on 2020-03-10 23:09

@mydongistiny Thanks for the fix

mydongistiny commented on 2020-03-10 15:10

@Magbed I posted a fix right below your comment.

getimiskon commented on 2020-03-10 14:59

As far as I know, It's a bug on GTK-based software. For example, the navigation buttons on Thunar (previous, next and parent folder) don't appear as they should. But they look normal on non-GTK programs.

txtsd commented on 2020-03-10 12:35

I'm having problems too, but only in gnome/mate applications.

Magbed commented on 2020-03-10 11:16

Having issues in gnome 3.36 with some icons not displaying

mydongistiny commented on 2020-03-09 02:33

If anyone is having problems with the icons displaying, I've updated the pkgbuild to apply a patch to fix the scalable svg's and pushed it to github:

elParaguayo commented on 2019-02-21 19:36

[Original post removed - issue was my ISP mucking up SSL connections with github...]

S13ntist commented on 2019-02-19 05:45

Can you please move the meson build from prepare() to build()?

Aurutils srcver fails if meson is not installed, as it tries to run the prepare function