Package Details: pantheon-applications-menu-git 2.7.1.r32.1c142f0b-1

Git Clone URL: https://aur.archlinux.org/pantheon-applications-menu-git.git (read-only, click to copy)
Package Base: pantheon-applications-menu-git
Description: The Pantheon Application Menu
Upstream URL: https://github.com/elementary/applications-menu
Licenses: GPL3
Groups: pantheon-unstable
Conflicts: pantheon-applications-menu
Provides: pantheon-applications-menu
Submitter: alucryd
Maintainer: quequotion
Last Packager: quequotion
Votes: 32
Popularity: 0.126392
First Submitted: 2017-05-07 14:21
Last Updated: 2020-10-11 13:49

Latest Comments

1 2 3 4 5 6 ... Next › Last »

quequotion commented on 2020-11-16 00:50

@btd1337

Upstream has not yet updated this to build against the new version of wingpanel, although that time is sure to come.

btd1337 commented on 2020-11-06 21:31

It needs update to support libwingpanel-3.0.so

DAC324 commented on 2020-09-29 07:24

While installing, I get

No such key “show-unicode-menu” in schema “org.gnome.desktop.interface” as specified in override file “/usr/share/glib-2.0/schemas/25_pantheon-default-settings.gschema.override”; ignoring override for this key.
No such key “numlock-state” in schema “org.gnome.settings-daemon.peripherals.keyboard” as specified in override file “/usr/share/glib-2.0/schemas/25_pantheon-default-settings.gschema.override”; ignoring override for this key.
Error parsing key “screensaver” in schema “org.gnome.settings-daemon.plugins.media-keys” as specified in override file “/usr/share/glib-2.0/schemas/25_pantheon-default-settings.gschema.override”: 0-10:can not parse as value of type 'as'. Ignoring override for this key.
No such key “terminal” in schema “org.gnome.settings-daemon.plugins.media-keys” as specified in override file “/usr/share/glib-2.0/schemas/25_pantheon-default-settings.gschema.override”; ignoring override for this key.
This also occurs for a lot of other Pantheon packages. What has to be done here?

quequotion commented on 2020-08-28 01:16

@SolarAquarion

Sorry for the delay, I'll try to get on that over the weekend.

SolarAquarion commented on 2020-08-17 18:41

it now depends on libhandy1

alucryd commented on 2019-03-05 12:30

Thought I had pushed the update already, thanks for the heads up.

bugsmanagement commented on 2019-03-03 20:30

Seems like the fixes the patch introduce is no longer needed anymore as it appears to be fixed upstream. Removing Prepare macro solves failed patching for me.

b2.vkrs commented on 2019-02-28 07:15

same issue as @PedroHLC, It looks like *.patch has some issues.

A.J commented on 2019-02-28 06:31

same issue as @PedroHLC

PedroHLC commented on 2019-02-25 18:21

==> Starting prepare()...
patching file meson.build
Hunk #1 FAILED at 34.
Hunk #2 FAILED at 54.
2 out of 2 hunks FAILED -- saving rejects to file meson.build.rej
==> ERROR: A failure occurred in prepare().

Any action needed?