Package Details: pamac-common 9.4.1-1

Git Clone URL: https://aur.archlinux.org/pamac.git (read-only, click to copy)
Package Base: pamac
Description: A Package Manager based on libalpm with AUR and Appstream support
Upstream URL: https://gitlab.manjaro.org/applications/pamac
Licenses: GPL3
Conflicts: pamac<=7.3.4-2, pamac-aur, pamac-common-dev
Provides: pamac-common=9.4.1-1
Submitter: lots0logs
Maintainer: lots0logs
Last Packager: lots0logs
Votes: 3
Popularity: 0.62
First Submitted: 2019-09-13 21:19
Last Updated: 2020-04-04 18:50

Latest Comments

Necco commented on 2020-03-08 13:38

@bkb Thanks, after the vala downgrade it worked flawlessly.

bkb commented on 2020-03-07 22:42

Same

None of the PKGBUILD are compilable (and only pamac-git is compilable between all the pamac, maybe look for an announce concerning a broken package on the home page)

Either it never was, either a new GCC or something don't compile anymore this "old" code

The last change was 2020-01-26 but everyone have popped here since yesterday, so an update has broken something

So you have to find what "big" package has been updated yesterday and we will know what have broken what (or just restore package state same as 2 days ago if you just want to compile)

EDIT: To compile it you have to downgrade vala or wait for the fix to get here or download yourself the new version https://gitlab.manjaro.org/applications/pamac/issues/735#note_15381

Necco commented on 2020-03-06 18:42

I'm having the exact same problem as hayao. Using up-to-date arch, all dependencies installed.

hayao commented on 2020-03-06 09:43

I can't build this packages.

==> Starting build()...
Directory already configured.

Just run your build command (e.g. ninja) and Meson will regenerate as necessary.
If ninja fails, run "ninja reconfigure" or "meson --reconfigure"
to force Meson to regenerate.

If build failures persist, run "meson setup --wipe" to rebuild from scratch
using the same options as passed when configuring the build.
To change option values, run "meson configure" instead.
[2/65] Compiling Vala source ../src/version.vala ../src/packag...onfig.vala ../src/pamac_config_daemon.vala ../src/daemon.vala.
../src/alpm_package.vala:51.3-51.26: warning: method `Pamac.AlpmPackage.dup' never used
        internal AlpmPackage dup () {
        ^^^^^^^^^^^^^^^^^^^^^^^^
../src/alpm_package.vala:147.1-147.20: warning: method `compare_name_pkg' never used
int compare_name_pkg (Pamac.Package pkg_a, Pamac.Package pkg_b) {
^^^^^^^^^^^^^^^^^^^^
../src/alpm_utils.vala:781.3-781.33: warning: method `Pamac.AlpmUtils.trans_check_prepare' never used
        public bool trans_check_prepare (bool sysupgrade,
        ^^^^^^^^^^^^^^^^^^^^^^^^^^^^^^^
Compilation succeeded - 3 warning(s)
[4/62] Compiling Vala source ../src/package.vala ../src/alpm_p...src/transaction_interface_daemon.vala ../src/transaction.vala.
../src/alpm_package.vala:147.1-147.20: warning: method `compare_name_pkg' never used
int compare_name_pkg (Pamac.Package pkg_a, Pamac.Package pkg_b) {
^^^^^^^^^^^^^^^^^^^^
../src/alpm_config.vala:354.2-354.18: warning: method `AlpmConfig.write' never used
    public void write (HashTable<string,Variant> new_conf) {
    ^^^^^^^^^^^^^^^^^
../src/alpm_utils.vala:575.3-575.28: warning: method `Pamac.AlpmUtils.download_pkg' never used
        public string download_pkg (string sender, string url) {
        ^^^^^^^^^^^^^^^^^^^^^^^^^^
Compilation succeeded - 3 warning(s)
[5/59] Compiling C object 'src/25a6634@@pamac-daemon@exe/meson-generated_alpm_utils.c.o'.
FAILED: src/25a6634@@pamac-daemon@exe/meson-generated_alpm_utils.c.o 
ccache cc -Isrc/25a6634@@pamac-daemon@exe -Isrc -I../src -I/usr/include/glib-2.0 -I/usr/lib/glib-2.0/include -I/usr/lib/libffi-3.2.1/include -I/usr/include/libmount -I/usr/include/blkid -I/usr/include/json-glib-1.0 -I/usr/include/libsoup-2.4 -I/usr/include/libxml2 -I/usr/include/polkit-1 -I/usr/include/libappstream-glib -I/usr/include/gdk-pixbuf-2.0 -I/usr/include/uuid -fdiagnostics-color=always -pipe -w -g -march=x86-64 -mtune=generic -O2 -fno-plt -D_FORTIFY_SOURCE=2 -pthread '-DGETTEXT_PACKAGE="pamac"' -D_FILE_OFFSET_BITS=64 -MD -MQ 'src/25a6634@@pamac-daemon@exe/meson-generated_alpm_utils.c.o' -MF 'src/25a6634@@pamac-daemon@exe/meson-generated_alpm_utils.c.o.d' -o 'src/25a6634@@pamac-daemon@exe/meson-generated_alpm_utils.c.o' -c 'src/25a6634@@pamac-daemon@exe/alpm_utils.c'
alpm_utils.c: In function 'pamac_alpm_utils_update_dbs':
alpm_utils.c:2621:4: error: function '__errno_location' is initialized like a variable
alpm_utils.c: In function 'pamac_alpm_utils_trans_init':
alpm_utils.c:3579:3: error: function '__errno_location' is initialized like a variable
alpm_utils.c: In function 'pamac_alpm_utils_trans_sysupgrade':
alpm_utils.c:3676:3: error: function '__errno_location' is initialized like a variable
alpm_utils.c: In function 'pamac_alpm_utils_trans_add_pkg_real':
alpm_utils.c:3853:3: error: function '__errno_location' is initialized like a variable
alpm_utils.c: In function 'pamac_alpm_utils_trans_load_pkg':
alpm_utils.c:4818:3: error: function '__errno_location' is initialized like a variable
alpm_utils.c:4888:4: error: function '__errno_location' is initialized like a variable
alpm_utils.c: In function 'pamac_alpm_utils_trans_remove_pkg':
alpm_utils.c:5076:4: error: function '__errno_location' is initialized like a variable
alpm_utils.c: In function 'pamac_alpm_utils_trans_prepare_real':
alpm_utils.c:5567:3: error: function '__errno_location' is initialized like a variable
alpm_utils.c: In function 'pamac_alpm_utils_build_prepare':
alpm_utils.c:7660:4: error: function '__errno_location' is initialized like a variable
alpm_utils.c: In function 'pamac_alpm_utils_trans_commit_real':
alpm_utils.c:10236:3: error: function '__errno_location' is initialized like a variable
[10/59] Compiling C object 'src/25a6634@@pamac-daemon@exe/meson-generated_daemon.c.o'.
ninja: build stopped: subcommand failed.
==> ERROR: A failure occurred in build().
    Aborting...