Package Details: package-query-git 1.12.r0.g840a000-1

Git Clone URL: (read-only, click to copy)
Package Base: package-query-git
Description: Query ALPM and AUR
Upstream URL:
Licenses: GPL
Conflicts: package-query
Provides: package-query=1.12
Submitter: tuxce
Maintainer: archlinuxfr (Skunnyk, f2404)
Last Packager: f2404
Votes: 149
Popularity: 0.006350
First Submitted: 2010-03-15 13:14
Last Updated: 2021-06-02 15:22

Dependencies (3)

Required by (7)

Sources (1)

Latest Comments

« First ‹ Previous 1 2 3 4 5 6 7 8 Next › Last »

Anonymous comment on 2013-04-16 08:31

Arrgh, I clicked wrong. And accidentally flagged this package out of date. How do I unflag it?!

Scimmia commented on 2013-04-05 18:58

Army, read the Wiki page about the AUR. The base-devel group is assumed to be installed. Autoconf is part of that.

Anonymous comment on 2013-04-05 07:47

I get

==> Starting build()...
+ aclocal -I m4 --install
sh: autom4te: command not found
aclocal: error: echo failed with exit status: 127
+ autoheader
./ line 4: autoheader: command not found
+ automake --foreign
sh: autoconf: command not found
automake: error: autoconf failed with exit status: 127
+ autoconf
./ line 6: autoconf: command not found
==> ERROR: A failure occurred in build().

Please add autoconf to the makedepends.

tuxce commented on 2013-04-03 12:17

@Det, thanks

Det commented on 2013-04-01 13:26

That kind of VCS handling is no longer required in pacman 4.1:,


vodik commented on 2012-04-30 09:15


"Install base-devel (pacman -S base-devel), because members of this group are not explicitly required by AUR packages which may not build without them (more info in this thread)."

lafka commented on 2012-04-24 10:18

base-devel should be added as dependency.

tuxce commented on 2012-02-03 07:08

It's fixed, try again.

Anonymous comment on 2012-02-03 00:18

Tried to build manually, didn't work. Help?

$ make
make all-recursive
make[1]: Entering directory `/tmp/package-query-git/package-query-build'
Making all in src
make[2]: Entering directory `/tmp/package-query-git/package-query-build/src'
gcc -DLOCALEDIR=\"/usr/share/locale\" -DCONFFILE=\"/etc/pacman.conf\" -DROOTDIR=\"/\" -DDBPATH=\"/var/lib/pacman/\" -DAUR_BASE_URL=\"\" -DHAVE_CONFIG_H -DGIT_VERSION=\"1.0.1-2-gd992\" -I. -I.. -D_GNU_SOURCE -g -O2 -MT aur.o -MD -MP -MF .deps/aur.Tpo -c -o aur.o aur.c
aur.c: In function ‘aur_request’:
aur.c:486:49: error: request for member ‘data’ in something not a structure or union
make[2]: *** [aur.o] Error 1
make[2]: Leaving directory `/tmp/package-query-git/package-query-build/src'
make[1]: *** [all-recursive] Error 1
make[1]: Leaving directory `/tmp/package-query-git/package-query-build'
make: *** [all] Error 2

benjarobin commented on 2012-01-21 11:58

Please update provides=('package-query=0.8') to '1.0'