Package Details: ossia-score 2.5.2-1

Git Clone URL: (read-only, click to copy)
Package Base: ossia-score
Description: ossia score, an interactive sequencer for the intermedia arts
Upstream URL:
Licenses: GPLv3
Conflicts: ossia-score-git
Provides: ossia-score=2.5.2
Replaces: i-score
Submitter: jcelerier
Maintainer: jcelerier
Last Packager: jcelerier
Votes: 7
Popularity: 0.75
First Submitted: 2018-04-26 22:11
Last Updated: 2019-08-26 10:42

Latest Comments

« First ‹ Previous 1 2

dvzrv commented on 2018-03-07 20:35

If we get up to 10 votes, I'll move this to [community]! Also, check the pro-audio mailing list:

jcelerier commented on 2017-11-20 10:15

@rcrath hi! that's a nice detective work and a very good overview of the current situation :p There's indeed a bit of turmoil til the end of the year.

I can reproduce the build failure, I'll try to investigate it this week. Sounds like the correct c++ standard version is not set in the PKGBUILD...

The next version will have complete audio sequencer features but there's still many months of work to get something usable as a daily driver (and I have to finish my thesis before).

rcrath commented on 2017-11-20 06:39

seems there are two versions, a stable version 2 called score instead of i-score, and a new version 3 that is in alpha, unstable, and not yet feature complete which looks like it will be way more interesting as it develops but is not yet ready for prime time. I'll probably just try to compile that from source if I get around to it.

rcrath commented on 2017-11-20 06:36

looks like the project is getting a reorg, name change, and such. see

I won't try to install until it sorts out a little better upstream. Thanks though!

rcrath commented on 2017-11-20 03:02

Hi again, had to do a clean system reinstall. when I install through aur, I get following error during build:


CMake Error at /tmp/yaourt-tmp-rich/aur-i-score/src/i-score/API/CMake/cmake-modules/cotire.cmake:1848 (message):
cotire: error 1 precompiling
Call Stack (most recent call first):
/tmp/yaourt-tmp-rich/aur-i-score/src/i-score/API/CMake/cmake-modules/cotire.cmake:3521 (cotire_precompile_prefix_header)

make[3]: *** [API/OSSIA/CMakeFiles/ossia.dir/build.make:64: API/OSSIA/cotire/ossia_CXX_prefix.hxx.gch] Error 1
make[2]: *** [CMakeFiles/Makefile2:439: API/OSSIA/CMakeFiles/ossia.dir/all] Error 2
make[1]: *** [CMakeFiles/Makefile2:569: API/OSSIA/CMakeFiles/all_unity.dir/rule] Error 2
make: *** [Makefile:327: all_unity] Error 2
==> ERROR: A failure occurred in build().
==> ERROR: Makepkg was unable to build iscore-git.
==> Restart building i-score ? [y/N]


jcelerier commented on 2017-05-18 10:09

sorry, I forgot to update. the latest package should directly work now.

rcrath commented on 2017-05-18 07:16

launches from command line but not .desktop file. removing .sh from the exec line in the .desktop file cures it. Thanks for updating!

jcelerier commented on 2017-05-02 14:24

@rcrath okay, actually the was a relic that was not needed anymore. I updated the git repo with a new desktop file that just calls i-score directly; however I want to do some other fixes before releasing a new version. Thanks for your tests !

rcrath commented on 2017-05-02 04:45

Thank you for this package. I can launch from the command line fine ('i-score'), but launching from /usr/share/applications/i-score.desktop, which executed /usr/bin/ fails to launch. Tried from a terminal with no path (not found) and with the full path to the sh file, which resulted in:

> /usr/bin/ line 6: bin/i-score: No such file or directory