Package Details: opencv-git 4.0.0.r81.g197285d12a-1

Git Clone URL: https://aur.archlinux.org/opencv-git.git (read-only, click to copy)
Package Base: opencv-git
Description: Open Source Computer Vision Library
Upstream URL: https://opencv.org/
Licenses: BSD
Conflicts: opencv
Provides: opencv=4.0.0.r81.g197285d12a
Submitter: chenxing
Maintainer: andrewSC
Last Packager: andrewSC
Votes: 41
Popularity: 0.000000
First Submitted: 2012-07-31 00:21
Last Updated: 2019-08-13 13:07

Dependencies (25)

Required by (296)

Sources (2)

Latest Comments

1 2 3 4 5 6 ... Next › Last »

andrewSC commented on 2021-05-13 21:51

I will take a look in the next day or so

jfernandz commented on 2021-05-11 22:06

I'm having the very same error than @carlosnewmusic

carlosnewmusic commented on 2021-05-08 02:24

1525 | void LAPACK_dgels_base( | ^~~~~~~~~~~~~~~~~ [ 6%] Building CXX object 3rdparty/protobuf/CMakeFiles/libprotobuf.dir/src/google/protobuf/service.cc.o make[2]: [modules/core/CMakeFiles/opencv_core.dir/build.make:509: modules/core/CMakeFiles/opencv_core.dir/src/hal_internal.cpp.o] Error 1 make[2]: Se espera a que terminen otras tareas.... [ 7%] Building CXX object 3rdparty/protobuf/CMakeFiles/libprotobuf.dir/src/google/protobuf/source_context.pb.cc.o [ 7%] Building CXX object 3rdparty/protobuf/CMakeFiles/libprotobuf.dir/src/google/protobuf/struct.pb.cc.o [ 7%] Building CXX object 3rdparty/protobuf/CMakeFiles/libprotobuf.dir/src/google/protobuf/stubs/mathlimits.cc.o [ 7%] Building CXX object 3rdparty/protobuf/CMakeFiles/libprotobuf.dir/src/google/protobuf/stubs/substitute.cc.o [ 7%] Building CXX object 3rdparty/protobuf/CMakeFiles/libprotobuf.dir/src/google/protobuf/text_format.cc.o [ 7%] Building CXX object 3rdparty/protobuf/CMakeFiles/libprotobuf.dir/src/google/protobuf/timestamp.pb.cc.o [ 7%] Building CXX object 3rdparty/protobuf/CMakeFiles/libprotobuf.dir/src/google/protobuf/unknown_field_set.cc.o [ 7%] Building CXX object 3rdparty/protobuf/CMakeFiles/libprotobuf.dir/src/google/protobuf/type.pb.cc.o [ 7%] Building CXX object 3rdparty/protobuf/CMakeFiles/libprotobuf.dir/src/google/protobuf/util/delimited_message_util.cc.o [ 7%] Building CXX object 3rdparty/protobuf/CMakeFiles/libprotobuf.dir/src/google/protobuf/util/field_comparator.cc.o [ 7%] Building CXX object 3rdparty/protobuf/CMakeFiles/libprotobuf.dir/src/google/protobuf/util/field_mask_util.cc.o [ 7%] Building CXX object 3rdparty/protobuf/CMakeFiles/libprotobuf.dir/src/google/protobuf/util/internal/datapiece.cc.o [ 7%] Building CXX object 3rdparty/protobuf/CMakeFiles/libprotobuf.dir/src/google/protobuf/util/internal/default_value_objectwriter.cc.o [ 7%] Building CXX object 3rdparty/protobuf/CMakeFiles/libprotobuf.dir/src/google/protobuf/util/internal/field_mask_utility.cc.o [ 7%] Building CXX object 3rdparty/protobuf/CMakeFiles/libprotobuf.dir/src/google/protobuf/util/internal/json_escaping.cc.o [ 7%] Building CXX object 3rdparty/protobuf/CMakeFiles/libprotobuf.dir/src/google/protobuf/util/internal/json_objectwriter.cc.o [ 7%] Building CXX object 3rdparty/protobuf/CMakeFiles/libprotobuf.dir/src/google/protobuf/util/internal/json_stream_parser.cc.o [ 7%] Building CXX object 3rdparty/protobuf/CMakeFiles/libprotobuf.dir/src/google/protobuf/util/internal/object_writer.cc.o [ 7%] Building CXX object 3rdparty/protobuf/CMakeFiles/libprotobuf.dir/src/google/protobuf/util/internal/proto_writer.cc.o [ 7%] Building CXX object 3rdparty/protobuf/CMakeFiles/libprotobuf.dir/src/google/protobuf/util/internal/protostream_objectsource.cc.o [ 8%] Building CXX object 3rdparty/protobuf/CMakeFiles/libprotobuf.dir/src/google/protobuf/util/internal/protostream_objectwriter.cc.o [ 8%] Building CXX object 3rdparty/protobuf/CMakeFiles/libprotobuf.dir/src/google/protobuf/util/internal/type_info.cc.o [ 8%] Building CXX object 3rdparty/protobuf/CMakeFiles/libprotobuf.dir/src/google/protobuf/util/internal/utility.cc.o [ 8%] Building CXX object 3rdparty/protobuf/CMakeFiles/libprotobuf.dir/src/google/protobuf/util/json_util.cc.o [ 8%] Building CXX object 3rdparty/protobuf/CMakeFiles/libprotobuf.dir/src/google/protobuf/util/message_differencer.cc.o [ 8%] Building CXX object 3rdparty/protobuf/CMakeFiles/libprotobuf.dir/src/google/protobuf/util/time_util.cc.o [ 8%] Building CXX object 3rdparty/protobuf/CMakeFiles/libprotobuf.dir/src/google/protobuf/util/type_resolver_util.cc.o [ 8%] Building CXX object 3rdparty/protobuf/CMakeFiles/libprotobuf.dir/src/google/protobuf/wire_format.cc.o [ 8%] Building CXX object 3rdparty/protobuf/CMakeFiles/libprotobuf.dir/src/google/protobuf/wrappers.pb.cc.o [ 8%] Linking CXX static library ../lib/liblibprotobuf.a [ 8%] Built target libprotobuf make[1]: [CMakeFiles/Makefile2:4541: modules/core/CMakeFiles/opencv_core.dir/all] Error 2 make: [Makefile:166: all] Error 2 ==> ERROR: Se produjo un fallo en build().

verge36 commented on 2021-05-01 21:13

I believe there is a typo in the PKGBUILD. Should it not be -DOPENCV_ENABLE_NONFREE=ON \

I also had to compile and install openblas-lapack instead of lapack + blas to successfully compile.

tomasstorck commented on 2021-02-25 16:43

Please consider adding ant as a dependency:

==> Retrieving sources...
  -> Cloning opencv git repo...
(...)
  -> Cloning opencv_contrib git repo...
(...)
==> Validating source files with sha512sums...
    opencv ... Skipped
    opencv_contrib ... Skipped
==> Making package: opencv-git 4.1.1.r65.gbf0765fc7f-1 (Thu 25 Feb 2021 17:35:37)
==> Checking runtime dependencies...
==> Checking buildtime dependencies...
==> Missing dependencies:
  -> ant
  -> java-environment
==> ERROR: Could not resolve all dependencies.
error making: opencv-git

olko commented on 2019-12-23 07:33

Why is SSE3 disabled for x86_64?

PKGBUILD:

[[ "$CARCH" = 'x86_64' ]] && _cmakeopts+=('-DCPU_BASELINE_DISABLE=SSE3 -DCPU_BASELINE_REQUIRE=SSE2')

Shouldn't it be the other way around?

[[ "$CARCH" = 'x86_64' ]] && _cmakeopts+=('-DCPU_BASELINE_DISABLE=SSE2 -DCPU_BASELINE_REQUIRE=SSE3')

At least on my architecture (broadwell) SSE3 is supported.

Samega7Cattac commented on 2019-11-26 15:04

I'm having issues compiling: https://paste.ubuntu.com/p/rHryq4VHhb/

inochi commented on 2019-08-08 11:00

@ruestique add '-DEIGEN_INCLUDE_PATH=/usr/include/eigen3' to _cmakeopts, see https://github.com/opencv/opencv/issues/14868.

ruestique commented on 2019-08-02 07:50

@Pastafarianist +1

Pastafarianist commented on 2019-07-22 13:07

Package fails to build with the following error:

Scanning dependencies of target opencv_core_pch_dephelp
[  6%] Building CXX object modules/core/CMakeFiles/opencv_core_pch_dephelp.dir/opencv_core_pch_dephelp.cxx.o
In file included from /home/ser/.cache/yay/opencv-git/src/opencv/modules/core/src/precomp.hpp:55,
                 from /home/ser/.cache/yay/opencv-git/src/build/modules/core/opencv_core_pch_dephelp.cxx:1:
/home/ser/.cache/yay/opencv-git/src/opencv/modules/core/include/opencv2/core/private.hpp:66:12: fatal error: Eigen/Core: No such file or directory
   66 | #  include <Eigen/Core>
      |            ^~~~~~~~~~~~
compilation terminated.
make[2]: *** [modules/core/CMakeFiles/opencv_core_pch_dephelp.dir/build.make:63: modules/core/CMakeFiles/opencv_core_pch_dephelp.dir/opencv_core_pch_dephelp.cxx.o] Error 1
make[1]: *** [CMakeFiles/Makefile2:2467: modules/core/CMakeFiles/opencv_core_pch_dephelp.dir/all] Error 2
make: *** [Makefile:163: all] Error 2
==> ERROR: A failure occurred in build().
    Aborting...
Error making: opencv-git