Package Details: opencpn 5.2.4-2

Git Clone URL: (read-only, click to copy)
Package Base: opencpn
Description: Open Source Chart Plotting / Marine Navigation
Upstream URL:
Licenses: GPL2
Submitter: None
Maintainer: trougnouf (gromain)
Last Packager: trougnouf
Votes: 31
Popularity: 0.030822
First Submitted: 2009-07-08 14:25
Last Updated: 2020-10-25 09:42

Latest Comments

« First ‹ Previous 1 2 3 4 5 6 7 8 Next › Last »

Npa commented on 2019-05-14 21:38

Great ! I thank you very much.

ruppor commented on 2019-05-14 21:29


I have incorporated the wxWidgets patch produced by software devs as described here:

Package builds fine on my machine, I've built it twice today. Hope this fixes issues for those whose builds were failing.

Npa commented on 2019-05-14 19:19

Hello, is there any chance of using this software in the coming weeks? I really use it to sail... Thanks

ve7it commented on 2019-04-14 05:17

Builds are still broken on Arch package manager. Errors pop up at link time with problems related to wxwidgets. I have not figured out how to alter the build files when running the package manager.. Any chance the hindsholm patch mentioned below can be done on the repository so we can move forward? Thank you guys.

my failed build log is at

linking issues start at line 1242

Npa commented on 2019-04-02 21:44

Thanks to you Hindsholm but using this patch is above my skills for the moment (i dont know what to do...).

hindsholm commented on 2019-04-02 09:28

I got a lot of linker errors with wxWidgets, but they could be solved by the patch mentioned in this issue:

Npa commented on 2019-03-29 21:15

I tried to build in a clean chroot ang got the same error ? undefined reference to `webkit_web_view_get_main_resource' collect2: error: ld returned 1 exit status make[2]: [CMakeFiles/opencpn.dir/build.make:1755: opencpn] Error 1 make[2]: Leaving directory '/build/opencpn/src/OpenCPN-5.0.0' make[1]: [CMakeFiles/Makefile2:125: CMakeFiles/opencpn.dir/all] Error 2 make[1]: Leaving directory '/build/opencpn/src/OpenCPN-5.0.0' make: *** [Makefile:155: all] Error 2

Npa commented on 2019-03-29 10:44


Please excuse my poor english. I have a error during installation :

make: *** [Makefile:155: all] Error 2 ==> ERREUR : Une erreur s’est produite dans build().

Can you help me please ?

kikoloche commented on 2018-12-08 17:08

I got build it in a clean chroot. Thanks

Mr.Elendig commented on 2018-11-20 10:15 first hit on the wiki.