Package Details: nushell 0.34.0-2

Git Clone URL: https://aur.archlinux.org/nushell.git (read-only, click to copy)
Package Base: nushell
Description: A new type of shell.
Upstream URL: https://www.nushell.sh
Keywords: rust shell
Licenses: MIT
Submitter: kbumsik
Maintainer: KokaKiwi (flaviut, onlineamateur)
Last Packager: KokaKiwi
Votes: 12
Popularity: 0.95
First Submitted: 2019-08-26 00:55
Last Updated: 2021-07-14 18:11

Latest Comments

1 2 3 Next › Last »

rustemb commented on 2021-07-14 12:56

nushell-0.34.0.tar.gz has no valid sha256sums

xyproto commented on 2021-06-16 09:00

The package does not build here, because:

error[E0658]: use of unstable library feature 'renamed_spin_loop'
see issue #55002 <https://github.com/rust-lang/rust/issues/55002> for more information
add `#![feature(renamed_spin_loop)]` to the crate attributes to enable

Almindor commented on 2021-01-16 00:57

This is a general issue with Cargo but could you add support for respecting the CARGO_TARGET_DIR env var? If that is set the build fails because it tries to find the build artefacts in the wrong folder.

Just replacing target/release/... with $TD/release/... should do the trick where TD=${CARGO_TARGET_DIR:-target}

tmladek commented on 2020-12-28 09:20

Anybody seen this?

error[E0658]: use of unstable library feature 'tau_constant'
  --> crates/nu-cli/src/commands/math/eval.rs:95:20
   |
95 |     ctx.var("tau", std::f64::consts::TAU);
   |                    ^^^^^^^^^^^^^^^^^^^^^
   |
   = note: see issue #66770 <https://github.com/rust-lang/rust/issues/66770> for more information

error[E0277]: the trait bound `std::string::String: std::convert::From<char>` is not satisfied
   --> crates/nu-cli/src/commands/char_.rs:70:21
    |
70  |                     UntaggedValue::string(output).into_value(name.tag()),
    |                     ^^^^^^^^^^^^^^^^^^^^^ the trait `std::convert::From<char>` is not implemented for `std::string::String`
    | 
   ::: /home/t/.cache/pikaur/build/nushell/src/nushell-0.24.1/crates/nu-protocol/src/value.rs:162:27
    |
162 |     pub fn string(s: impl Into<String>) -> UntaggedValue {
    |                           ------------ required by this bound in `nu_protocol::value::UntaggedValue::string`
    |
    = help: the following implementations were found:
              <std::string::String as std::convert::From<&mut str>>
              <std::string::String as std::convert::From<&std::string::String>>
              <std::string::String as std::convert::From<&str>>
              <std::string::String as std::convert::From<std::borrow::Cow<'a, str>>>
              <std::string::String as std::convert::From<std::boxed::Box<str>>>
    = note: required because of the requirements on the impl of `std::convert::Into<std::string::String>` for `char`

error: aborting due to 2 previous errors

Some errors have detailed explanations: E0277, E0658.
For more information about an error, try `rustc --explain E0277`.
error: could not compile `nu-cli`.

To learn more, run the command again with --verbose.
==> ERROR: A failure occurred in build().
    Aborting...

icewind commented on 2020-07-22 12:35

libx11 and python are required as makedepends

TheGoliath commented on 2020-06-13 20:50

Updated, thank you for pointing that out :)

hak8or commented on 2020-06-13 20:47

Looks like the extraction process is broken, such that after extracting the .tar.gz you get nushell-0.15.0 instead of just 0.15.0.

:: Parsing SRCINFO (1/1): nushell
==> Making package: nushell 0.15.0-2 (Sat 13 Jun 2020 04:46:38 PM EDT)
==> Retrieving sources...
  -> Found 0.15.0.tar.gz
==> Validating source files with sha256sums...
    0.15.0.tar.gz ... Passed
==> Making package: nushell 0.15.0-2 (Sat 13 Jun 2020 04:46:39 PM EDT)
==> Checking runtime dependencies...
==> Checking buildtime dependencies...
==> Retrieving sources...
  -> Found 0.15.0.tar.gz
==> Validating source files with sha256sums...
    0.15.0.tar.gz ... Passed
==> Removing existing $srcdir/ directory...
==> Extracting sources...
  -> Extracting 0.15.0.tar.gz with bsdtar
==> Sources are ready.
==> Making package: nushell 0.15.0-2 (Sat 13 Jun 2020 04:46:42 PM EDT)
==> Checking runtime dependencies...
==> Checking buildtime dependencies...
==> WARNING: Using existing $srcdir/ tree
==> Removing existing $pkgdir/ directory...
==> Entering fakeroot environment...
==> Starting package()...
/home/hak8or/.cache/yay/nushell/PKGBUILD: line 21: cd: /home/hak8or/.cache/yay/nushell/src/0.15.0: No such file or directory
==> ERROR: A failure occurred in package().
    Aborting...
Error making: nushell

~ took 7s 771ms
➜ ls /home/hak8or/.cache/yay/nushell/src/
0.15.0.tar.gz@  nushell-0.15.0/

icewind commented on 2020-06-13 16:44

libx11 is required as makedepend

TheGoliath commented on 2020-06-13 09:59

Okay

erayerdin commented on 2020-06-13 09:28

>> Okay, now it installed successfully. I think it was something about my computer.