Package Details: mumps 5.2.1-3

Git Clone URL: https://aur.archlinux.org/mumps.git (read-only)
Package Base: mumps
Description: Sparse solver library using Gaussian elimination
Upstream URL: http://mumps.enseeiht.fr
Licenses: custom
Conflicts: mumps-par, mumps4
Provides: mumps
Submitter: mickele
Maintainer: MartinDiehl
Last Packager: MartinDiehl
Votes: 13
Popularity: 0.47
First Submitted: 2009-04-05 16:37
Last Updated: 2019-11-26 15:25

Latest Comments

« First ‹ Previous 1 2 3 4 5 6 Next › Last »

gdolle commented on 2013-08-03 14:25

I got a conflict between scotch_esmumps and ptscotch
(It seems that scotch_esmumps already provide ptscotch so ptscotch>5.17 might not be required)
Someone can confirm ?

gdolle commented on 2013-08-03 14:24

I got a conflict between scotch_esmumps and ptscotch
(It seems that scotch_esmumps already provide ptscotch so ptscotch>5.17 might not be required)
Someone can confirm ?

gdolle commented on 2013-08-03 14:24

I got a conflict between scotch_esmumps and ptscotch
(It seems that scotch_esmumps already provide ptscotch so ptscotch>5.17 might not be required)
Someone can confirm ?

gdolle commented on 2013-08-03 14:23

I got a conflict between scotch_esmumps and ptscotch
(It seems that scotch_esmumps already provide ptscotch so ptscotch>5.17 might not be required)
Someone can confirm ?

gdolle commented on 2013-08-03 14:16

I got a conflict between scotch_esmumps and ptscotch
(It seems that scotch_esmumps already provide ptscotch so ptscotch>5.17 might not be required)
Someone can confirm ?

foobarrior commented on 2013-03-28 11:33

ledomi, do foolowing:
rm /usr/include/scotch/*metis*

foobarrior commented on 2013-03-27 06:15

Update your dependencies!
-change mpich2 to mpich
-change parmetis-mpich2 to parmetis-mpich

Anonymous comment on 2012-11-20 19:16

@plutus I have the same problem, did you find a solution? thanks

@gauteh I tried to install from your link but I had the error any idea? thanks
make[1]: Entering directory `/home/julien/library/builds/arch-master2/mumps/src/MUMPS_4.10.0'
(cd src ; make s)
make[2]: Entering directory `/home/julien/library/builds/arch-master2/mumps/src/MUMPS_4.10.0/src'
make ARITH=s mumps_lib
make[3]: Entering directory `/home/julien/library/builds/arch-master2/mumps/src/MUMPS_4.10.0/src'
/opt/mpich2/bin/mpicc -march=x86-64 -mtune=generic -O2 -pipe -fstack-protector --param=ssp-buffer-size=4 -D_FORTIFY_SOURCE=2 -fPIC -I/opt/mpich2/include -I../include -DAdd_ -I../PORD/include/ -I/usr/include/scotch -Dscotch -Dmetis -Dpord -Dptscotch -Dparmetis -c mumps_orderings.c -o mumps_orderings.o
In file included from mumps_orderings.h:100:0,
from mumps_orderings.c:54:
/opt/mpich2/include/parmetis.h:33:4: error: #error "Incorrect user-supplied value fo IDXTYPEWIDTH"
/opt/mpich2/include/parmetis.h:42:4: error: #error "Incorrect user-supplied value fo REALTYPEWIDTH"
/opt/mpich2/include/parmetis.h:66:14: error: unknown type name ‘idx_t’
....
make[3]: *** [mumps_orderings.o] Error 1
make[3]: Leaving directory `/home/julien/library/builds/arch-master2/mumps/src/MUMPS_4.10.0/src'
make[2]: *** [s] Error 2
make[2]: Leaving directory `/home/julien/library/builds/arch-master2/mumps/src/MUMPS_4.10.0/src'
make[1]: *** [mumps_lib] Error 2
make[1]: Leaving directory `/home/julien/library/builds/arch-master2/mumps/src/MUMPS_4.10.0'
make: *** [s] Error 2

gauteh commented on 2012-09-23 12:04

check out: https://github.com/gauteh/arch/tree/master/mumps and https://github.com/gauteh/arch/tree/master/scotch_esmumps for version that doesnt have nodewnd problem.

Anonymous comment on 2012-03-01 00:38

got this error: any idea?

/opt/mpich2/bin/mpif77 -Dintel_ -DALLOW_NON_INIT -march=x86-64 -mtune=generic -O2 -pipe -fstack-protector --param=ssp-buffer-size=4 -D_FORTIFY_SOURCE=2 -fPIC -I/opt/mpich2/include -I. -I../include -c ssimpletest.F
/opt/mpich2/bin/mpif77 -o ssimpletest -march=x86-64 -mtune=generic -O2 -pipe -fstack-protector --param=ssp-buffer-size=4 -D_FORTIFY_SOURCE=2 -fPIC -I/usr/include -I/opt/mpich2/include ssimpletest.o ../lib/libsmumps.a ../lib/libmumps_common.a -L/opt/mpich2/lib -lparmetis -lmetis -L../PORD/lib/ -lpord -L/usr/lib -lesmumps -lptscotch -lptscotcherr -lscalapack -llapack -lblacs -lblacsf77 -lblacs -L/opt/mpich2/lib/ -lmpich -lf77blas -latlas -lpthread
../lib/libsmumps.a(smumps_part2.o): In function `smumps_195_':
smumps_part2.F:(.text+0x200ff): undefined reference to `metis_nodewnd_'
collect2: ld returned 1 exit status
make[1]: *** [ssimpletest] Error 1
make[1]: Leaving directory `/tmp/yaourt-tmp-ste/aur-mumps/src/MUMPS_4.9.2/examples'
make: *** [sexamples] Error 2