Package Details: muffin-git 4.2.0.r2.gf0d02aa-1

Git Clone URL: https://aur.archlinux.org/muffin-git.git (read-only)
Package Base: muffin-git
Description: A window manager for GNOME
Upstream URL: https://github.com/linuxmint/muffin
Licenses: GPL
Conflicts: cinnamon<4.2.0, muffin
Provides: muffin=4.2.0.r2.gf0d02aa
Submitter: chenxiaolong
Maintainer: eschwartz
Last Packager: eschwartz
Votes: 85
Popularity: 0.043012
First Submitted: 2012-01-11 21:48
Last Updated: 2019-07-03 20:33

Latest Comments

« First ‹ Previous 1 2 3 4 5 6 7 8 ... Next › Last »

BlackLotus89 commented on 2012-04-09 14:26

Add a
git reset --hard 3905d441313cd4521dea96198e9f791baed20979
to hold 3.2* compatibility.

Ichigo-Roku commented on 2012-04-07 19:49

OK, thanks.

Anonymous comment on 2012-04-07 10:06

Please read the comments below. Yes it is normal, because it requires gtk >= 3.3.3, gtk 3.4 is released but in testing. Either activate testing or wait until it hits extra.

Ichigo-Roku commented on 2012-04-07 09:36

When I try to install it, it says to me that I need gtk+-3.0 >= 3.3.3 is that normal ? The last version in Extra is 3.2.3-3.

greenfuse commented on 2012-04-06 17:22

I have this problem when trying to install muffin-git

configure: error: Package requirements (gtk+-3.0 >= 3.3.3) were not met:

Requested 'gtk+-3.0 >= 3.3.3' but version of GTK+ is 3.2.3

chenxiaolong commented on 2012-04-05 17:13

@smeto: Fixed :)

Anonymous comment on 2012-04-05 16:51

@linfan: Known upstream bug, there is a fix floating somewhere in the issues but not yet included in current cinnamon.

Anonymous comment on 2012-04-05 16:35

I installed cinnamon, and cinnnamon-extensions-git and cinnamon-themes according to wiki with the dirty ls hack, but cinnamon settings won't launch. Also tride with cinnamon-git, same result. I presume it is due to gnome-3.4 in testing. Did not try to launch cinnamon-settings from term window. Will eventually try that to get some kind of info about what might be wrong, when I have some spare time in the future.

Anonymous comment on 2012-04-05 16:26

error on build:
CC display.lo
CC draw-workspace.lo
core/display.c: In function 'key_event_description':
core/display.c:2886:3: error: 'XKeycodeToKeysym' is deprecated (declared at /usr/include/X11/Xlib.h:1695) [-Werror=deprecated-declarations]
cc1: all warnings being treated as errors
make[4]: *** [display.lo] Error 1
make[4]: *** Waiting for unfinished jobs....
make[4]: Leaving directory `/home/admin/Desktop/muffin-git/src/muffin-build/src'
make[3]: *** [all-recursive] Error 1
make[3]: Leaving directory `/home/admin/Desktop/muffin-git/src/muffin-build/src'
make[2]: *** [all] Error 2
make[2]: Leaving directory `/home/admin/Desktop/muffin-git/src/muffin-build/src'
make[1]: *** [all-recursive] Error 1
make[1]: Leaving directory `/home/admin/Desktop/muffin-git/src/muffin-build'
make: *** [all] Error 2
==> ERROR: A failure occurred in build().
Aborting...

chenxiaolong commented on 2012-04-05 15:55

Thanks, I've removed the rat4's repository from the PKGBUILD.