Package Details: mt7630-pcie-wifi-dkms 1:2.1.0.r12.5193c55-1

Git Clone URL: https://aur.archlinux.org/mt7630-pcie-wifi-dkms.git (read-only)
Package Base: mt7630-pcie-wifi-dkms
Description: MT7630e PCIe Wifi (DKMS)
Upstream URL: https://github.com/neurobin/MT7630E
Licenses: GPL
Submitter: benjarobin
Maintainer: 0x9fff00
Last Packager: 0x9fff00
Votes: 12
Popularity: 0.000121
First Submitted: 2015-03-03 20:40
Last Updated: 2019-11-10 22:07

Latest Comments

« First ‹ Previous 1 2 3 4 5 6 Next › Last »

vianney commented on 2016-06-18 19:55

Hi, looks like everything's fine. Thanks! :)

benjarobin commented on 2016-06-18 18:27

Build fixed, but not tested since I do not have the hardware...

vianney commented on 2016-06-18 17:32

Hi there,
The installation fails with kernel 4.6.2-1, here is the log error output: http://sprunge.us/bXQf
Thank you for your time!

alihasnat07 commented on 2016-03-06 14:06

please can anyone help me? my laptop is asus tp 300la and WiFi card is Mt 7630e, I have been trying various fixes and nothing worked, can anyone help me with instructions,greately appreciated......

coolpyrofreak commented on 2016-02-16 17:52

Thanks for putting this together. Works great with my Asus X550ZA laptop.

benjarobin commented on 2016-01-13 17:46

I will try to fix it Sunday 17/01/2016 (on holiday...)

cyberunknown commented on 2016-01-13 15:16

Can't build with kernel 4.4.0.

AnAkkk commented on 2015-12-06 23:26

Indeed, the bluetooth module is not installed for some reason. Modifying the PKGBUILD to add it doesn't help, the module just won't load.

moco59 commented on 2015-11-20 03:01

Bluetooth not working?

minniux commented on 2015-09-29 20:26

UPDATE: This is fixed by the update of 30-09, thanks a lot
=====================
I'm getting a build error under the newly released kernel 4.2.1-1-ARCH

That's the build log:

/var/lib/dkms/mt7630-pcie-wifi/22.d9899f0/build/rt2x00mac.c: In function ‘rt2x00mac_configure_filter’:
/var/lib/dkms/mt7630-pcie-wifi/22.d9899f0/build/rt2x00mac.c:359:6: error: ‘FIF_PROMISC_IN_BSS’ undeclared (first use in this function)
FIF_PROMISC_IN_BSS;
^
/var/lib/dkms/mt7630-pcie-wifi/22.d9899f0/build/rt2x00mac.c:359:6: note: each undeclared identifier is reported only once for each function it appears in
scripts/Makefile.build:258: recipe for target '/var/lib/dkms/mt7630-pcie-wifi/22.d9899f0/build/rt2x00mac.o' failed
make[1]: *** [/var/lib/dkms/mt7630-pcie-wifi/22.d9899f0/build/rt2x00mac.o] Error 1
Makefile:1386: recipe for target '_module_/var/lib/dkms/mt7630-pcie-wifi/22.d9899f0/build' failed
make: *** [_module_/var/lib/dkms/mt7630-pcie-wifi/22.d9899f0/build] Error 2



Would appreciate any help