Package Details: mingw-w64-gtk2 2.24.32-1

Git Clone URL: (read-only, click to copy)
Package Base: mingw-w64-gtk2
Description: GObject-based multi-platform GUI toolkit (legacy) (mingw-w64)
Upstream URL:
Keywords: gnome gtk mingw
Licenses: LGPL
Submitter: Schala
Maintainer: lantw44
Last Packager: lantw44
Votes: 7
Popularity: 0.000000
First Submitted: 2013-04-01 11:35
Last Updated: 2018-04-30 15:54

Latest Comments

1 2 Next › Last »

lantw44 commented on 2015-08-20 03:44

The fix is available in both AUR package and the next gtk2 version. Thanks for reporting.

lantw44 commented on 2015-08-16 16:55

I filed a bug for the problem:

Alister.Hood commented on 2015-08-16 03:57

Somehow it seems to work if I disable this in makepkg.conf:

lantw44 commented on 2015-08-13 14:14

I cannot reproduce the problem in makechrootpkg and yaourt. Is there other error messages?

Alister.Hood commented on 2015-08-13 08:32

Does it not fail for other people like this?:

/usr/bin/install: cannot create regular file ‘/tmp/yaourt-tmp-root/aur-mingw-w64-gtk2/pkg/mingw-w64-gtk2/usr/i686-w64-mingw32/lib/gdk-win32-2.0.def’: No such file or directory
Makefile:1770: recipe for target 'install-def-file' failed

lantw44 commented on 2013-10-08 05:39

I upload a new PKGBUILD which keeps most of the files in /usr/$arch/share.

xantares commented on 2013-10-07 20:16


I think m4 macros should be kept: /usr/$arch/share/aclocal/gtk-2.0.m4
as there is a problem when building another package: mingw-w64-libglade because it wants AM_PATH_GTK_2_0.


Schala commented on 2013-06-17 15:55

I'm getting the same error.

lantw44 commented on 2013-06-15 07:22

I could not reproduce the problem, but I got a similar problem if I uncomment the following lines:

#if [ $_arch = "x86_64-w64-mingw32" ]; then
# rm "gtk/gtk.def"

However, the error occurred when making install, not making all.

lantw44 commented on 2013-06-15 07:19

I cannot reproduce the problem, but I get a similar error if I uncomment the following lines:

#if [ $_arch = "x86_64-w64-mingw32" ]; then
# rm "gtk/gtk.def"

Cannot export gtk_rc_set_default_files: symbol not defined
Cannot export gtk_ui_manager_add_ui_from_file: symbol not defined
Cannot export gtk_window_set_default_icon_from_file: symbol not defined
Cannot export gtk_window_set_icon_from_file: symbol not defined
collect2: error: ld returned 1 exit status
make[3]: *** [] Error 1
make[3]: Leaving directory
make[2]: *** [install-recursive] Error 1
make[2]: Leaving directory
make[1]: *** [install] Error 2
make[1]: Leaving directory
make: *** [install-recursive] Error 1