Package Details: mingw-w64-dbus 1.12.16-1

Git Clone URL: https://aur.archlinux.org/mingw-w64-dbus.git (read-only)
Package Base: mingw-w64-dbus
Description: Freedesktop.org message bus system (mingw-w64)
Upstream URL: https://wiki.freedesktop.org/www/Software/dbus/
Keywords: dbus freedesktop libdbus mingw mingw-w64
Licenses: GPL, custom
Provides: mingw-w64-libdbus
Submitter: Schala
Maintainer: pingplug
Last Packager: pingplug
Votes: 22
Popularity: 0.75
First Submitted: 2016-08-19 22:58
Last Updated: 2019-06-12 05:15

Latest Comments

« First ‹ Previous 1 2 3 4

Schala commented on 2012-09-11 00:28

I'm baffled as to how it compiled on my old Arch system. (1.6.4-1 that is)

brcha commented on 2012-09-10 11:06

@Schala, try now, I added --disable-systemd and it compiles on my system.

brcha commented on 2012-09-10 10:25

Hm, systemd isn't compiled for Windows, it wouldn't even work there as it does require Linux kernel, not to mention it wouldn't make sense to run it on Windows. I'll check the ./configure arguments, you probably have systemd installed on your system and dbus detects it and tries to use it. My guess is that adding something like --without-systemd would help.

Schala commented on 2012-09-10 01:10

Okay, I recently decided to start a fresh Linux install, but when building this package, I'm getting these errors when linking dbus-daemon.exe:


/usr/lib/gcc/i686-w64-mingw32/4.7.1/../../../../i686-w64-mingw32/bin/ld: cannot find -lsystemd-login
/usr/lib/gcc/i686-w64-mingw32/4.7.1/../../../../i686-w64-mingw32/bin/ld: cannot find -lsystemd-daemon

Schala commented on 2012-08-08 13:46

Successful upgrade here. Thanks

brcha commented on 2012-08-08 10:39

Well, it certainly does work, so I'll update this package to dbus-1.6.4. If you experience some errors with it, please leave a comment, and I'll revert back to 1.4.16 (which is what fedora's mingw-w64 builds use at the moment).

Schala commented on 2012-08-05 08:19

I do not know whether or not to flag this out of date. Does DBus 1.6.4 not work with mingw-w64?

skuda commented on 2012-06-26 15:04

Hi, i had to --disable-tests in configure to get it compiled on my machine, other way it fails with:


In file included from /usr/include/glib-2.0/gio/gio.h:47:0,
from corrupt.c:30:
/usr/include/glib-2.0/gio/gcredentials.h:67:1: error: unknown type name 'uid_t'
/usr/include/glib-2.0/gio/gcredentials.h:70:52: error: unknown type name 'uid_t'
CC test_marshal-marshal.o
make[3]: *** [test_corrupt-corrupt.o] Error 1
make[3]: *** Se espera a que terminen otras tareas....
dbus-daemon.c: In function 'teardown':
dbus-daemon.c:309:3: warning: passing argument 1 of 'TerminateProcess' makes pointer from integer without a cast [enabled by default]
In file included from /usr/lib/gcc/i686-w64-mingw32/4.7.1/../../../../i686-w64-mingw32/include/windows.h:60:0,
from dbus-daemon.c:38:
/usr/lib/gcc/i686-w64-mingw32/4.7.1/../../../../i686-w64-mingw32/include/winbase.h:1268:29: note: expected 'HANDLE' but argument is of type 'GPid'
make[3]: se sale del directorio `/var/tmp/yaourt-tmp-skuda/aur-mingw-w64-dbus/src/dbus-1.4.16/test'
make[2]: *** [all-recursive] Error 1
make[2]: se sale del directorio `/var/tmp/yaourt-tmp-skuda/aur-mingw-w64-dbus/src/dbus-1.4.16/test'
make[1]: *** [all-recursive] Error 1
make[1]: se sale del directorio `/var/tmp/yaourt-tmp-skuda/aur-mingw-w64-dbus/src/dbus-1.4.16'
make: *** [all] Error 2