Package Details: micronucleus-git 2.04.r6.g4d2481d-3

Git Clone URL: (read-only, click to copy)
Package Base: micronucleus-git
Description: ATTiny usb bootloader with a strong emphasis on bootloader compactness
Upstream URL:
Keywords: Attiny AVR microcontroller
Licenses: GPL
Conflicts: micronucleus
Provides: micronucleus
Submitter: yuvadm
Maintainer: yjun
Last Packager: yjun
Votes: 6
Popularity: 0.059880
First Submitted: 2016-03-26 14:57
Last Updated: 2021-02-28 05:51

Dependencies (2)

Required by (0)

Sources (1)

Latest Comments

yjun commented on 2021-02-28 04:51

@avanc fixed

avanc commented on 2021-02-24 08:16

I get this error message:

==> Starting build()...
Building command line tool: micronucleus...
gcc  -Ilibrary -O -g -D LINUX -o micronucleus micronucleus.c micronucleus_lib.o littleWire_util.o -static -L/usr/lib -lusb
/usr/bin/ld: cannot find -lusb
collect2: error: ld returned 1 exit status
make: *** [Makefile:59: micronucleus] Error 1
==> ERROR: A failure occurred in build().

However, libusb-compat is installed.

yjun commented on 2020-11-20 12:15

@skunk eugene fixed

skunk commented on 2019-12-26 22:46

I get

 library/micronucleus_lib.h:35:10: fatal error: usb.h: No such file or directory

    35 | #include <usb.h>

I guess, it's missing the build dependency libusb-compat

eugene commented on 2019-03-04 23:51

@C0rn3j diff with fix - set number of build jobs to 1:

diff --git a/PKGBUILD b/PKGBUILD
index 60f4130..27ff1c4 100644
@@ -10,6 +10,7 @@ license=(GPL)

 pkgver() {

C0rn3j commented on 2018-10-15 08:18

Fails to build

==> Updated version: micronucleus-git 2.03.r6.g1eda473-1

==> Starting build()...

Building library: micronucleus_lib...

gcc -Ilibrary -O -g -D LINUX -c library/micronucleus_lib.c

make: *** No rule to make target 'micronucleus_lib.o', needed by 'micronucleus'. Stop.

make: *** Waiting for unfinished jobs....

Building library: littleWire_util...

gcc -Ilibrary -O -g -D LINUX -c library/littleWire_util.c

==> ERROR: A failure occurred in build().


:: Unable to build micronucleus-git - makepkg exited with code: 4