Package Details: megasync 4.3.8.0-1

Git Clone URL: https://aur.archlinux.org/megasync.git (read-only, click to copy)
Package Base: megasync
Description: Easy automated syncing between your computers and your MEGA cloud drive
Upstream URL: https://github.com/meganz/MEGAsync
Licenses: custom:MEGA LIMITED CODE REVIEW LICENCE
Submitter: son_link
Maintainer: Kozeid
Last Packager: Kozeid
Votes: 362
Popularity: 4.18
First Submitted: 2014-09-01 18:12
Last Updated: 2020-12-21 19:47

Latest Comments

1 2 3 4 5 6 ... Next › Last »

romero commented on 2021-02-24 03:40

@MrSelfDestruct thanks a lot! Recompiling did the trick brilliantly.

chapa commented on 2021-02-04 03:29

as megasync, as megasync-bin failed

"Setting QT_SCREEN_SCALE_FACTORS= "DisplayPort-1=1" Error unsetting QT_QPA_PLATFORMTHEME vble zsh: segmentation fault (core dumped) megasync "

temporary fix: QT_SCALE_FACTOR=1 megasync

Manjaro x64 20.2.1, xfce

MrSelfDestruct commented on 2021-01-08 19:29

As with most issues with this package, if the application suddenly stops working and gives a megasync: symbol lookup error: megasync: undefined symbol: _ZNK8CryptoPP21KeyDerivationFunction16MinDerivedLengthEv error in the terminal, simply recompile it and it will work fine.

michaldybczak commented on 2021-01-07 21:26

Megasync worked well till recently and some updates forced me to recompile it. It turned out that the current build produces build error. I downgraded the package using version downloaded from the mega.nz site and... it works flawlessly.

m.schabhuettl commented on 2020-12-23 14:11

@servimo, @foozzi, @mithanan, @bartus: recompiling libpdfium before upgrading megasync fixes the issue.

bartus commented on 2020-12-23 08:25

@servimo, @foozzi, @mithanan: If I may suggest something, just use megasync-nopdfium i you can live without pdf preview in MEGASync ╮(˘、˘)╭

servimo commented on 2020-12-22 21:10

By changing in PKGBUILD like foozi (https://aur.archlinux.org/account/foozzi) libpdfium to libpdfium-nojs it seems to work

servimo commented on 2020-12-22 20:36

Error here: /usr/bin/ld: aviso: libicuuc.so.67, necessária para /usr/lib/gcc/x86_64-pc-linux-gnu/10.2.0/../../../../lib/libpdfium.so, não localizada (tente usar -rpath ou -rpath-link) /usr/bin/ld: /usr/lib/gcc/x86_64-pc-linux-gnu/10.2.0/../../../../lib/libpdfium.so: referência não definida para "u_tolower_67" /usr/bin/ld: /usr/lib/gcc/x86_64-pc-linux-gnu/10.2.0/../../../../lib/libpdfium.so: referência não definida para "u_toupper_67" /usr/bin/ld: /usr/lib/gcc/x86_64-pc-linux-gnu/10.2.0/../../../../lib/libpdfium.so: referência não definida para "u_isspace_67" /usr/bin/ld: /usr/lib/gcc/x86_64-pc-linux-gnu/10.2.0/../../../../lib/libpdfium.so: referência não definida para "u_isalnum_67" /usr/bin/ld: /usr/lib/gcc/x86_64-pc-linux-gnu/10.2.0/../../../../lib/libpdfium.so: referência não definida para "u_isalpha_67" collect2: error: ld returned 1 exit status make[1]: *** [Makefile:1187: megasync] Erro 1 make[1]: Saindo do diretório '/var/tmp/pamac-build-sergio/megasync/src/MEGAsync/src/MEGASync'

make: *** [Makefile:47: sub-MEGASync-make_first] Erro 2 ==> ERRO: Uma falha ocorreu em build(). Abortando...

mithanan commented on 2020-12-22 14:54

cannot build pacakge

/usr/bin/ld: warning: libicuuc.so.67, needed by /usr/lib/gcc/x86_64-pc-linux-gnu/10.2.0/../../../../lib/libpdfium.so, not found (try using -rpath or -rpath-link) /usr/bin/ld: /usr/lib/gcc/x86_64-pc-linux-gnu/10.2.0/../../../../lib/libpdfium.so: undefined reference to u_tolower_67' /usr/bin/ld: /usr/lib/gcc/x86_64-pc-linux-gnu/10.2.0/../../../../lib/libpdfium.so: undefined reference tou_toupper_67' /usr/bin/ld: /usr/lib/gcc/x86_64-pc-linux-gnu/10.2.0/../../../../lib/libpdfium.so: undefined reference to u_isspace_67' /usr/bin/ld: /usr/lib/gcc/x86_64-pc-linux-gnu/10.2.0/../../../../lib/libpdfium.so: undefined reference tou_isalnum_67' /usr/bin/ld: /usr/lib/gcc/x86_64-pc-linux-gnu/10.2.0/../../../../lib/libpdfium.so: undefined reference to `u_isalpha_67' collect2: error: ld returned 1 exit status make[1]: [Makefile:1106: megasync] Error 1 make[1]: Leaving directory '/home/mithanan/.cache/yay/megasync/src/MEGAsync/src/MEGASync' make: [Makefile:47: sub-MEGASync-make_first] Error 2 ==> ERROR: A failure occurred in build(). Aborting...

foozzi commented on 2020-12-19 17:04

Error: dependency not found: libpdfium, not installing . 11-2020 My Solution in PKGBUILD change libpdfium to libpdfium-nojs

just install https://aur.archlinux.org/packages/libpdfium-nojs/