Package Details: megasync-git v4.0.2.0.1.g2dec1949-1

Git Clone URL: https://aur.archlinux.org/megasync-git.git (read-only)
Package Base: megasync-git
Description: MEGASync Desktop App. (GIT Version)
Upstream URL: https://mega.co.nz/#sync
Licenses: custom:MEGA
Conflicts: megasync, megatools
Provides: megasync
Submitter: sl1pkn07
Maintainer: sl1pkn07
Last Packager: sl1pkn07
Votes: 17
Popularity: 0.083574
First Submitted: 2016-03-12 18:32
Last Updated: 2019-06-08 17:01

Latest Comments

1 2 3 Next › Last »

sl1pkn07 commented on 2019-06-08 17:01

om, done

attila123 commented on 2019-06-08 15:54

Hi, needs qt5-tools to compile, otherwise: /home/avangel/.cache/yay/megasync-git/PKGBUILD: line 56: lrelease-qt5: command not found

dreieck commented on 2018-11-28 23:33

@sl1pkn07: Submitted.

sl1pkn07 commented on 2018-11-28 14:31

https://github.com/meganz/MEGAsync/issues

dreieck commented on 2018-11-28 13:09

Fails to compile for me with:

make: Entering directory '/tmp/yaourt-tmp-felics/aur-fuse-megasync-git/src/build'
/bin/sh: -c: line 11: syntax error near unexpected token `|'
/bin/sh: -c: line 11: `echo "$py_files" |  | sed '$!N;$!N;$!N;$!N;$!N;$!N;$!N;s/\n/ /g' | sed '$!N;$!N;$!N;$!N;s/\n/ /g' | \'
make: *** [Makefile:2777: uninstall-pkgpythonPYTHON] Error 1
make: Leaving directory '/tmp/yaourt-tmp-felics/aur-fuse-megasync-git/src/build'
==> ERROR: A failure occurred in package_libmega-git().
    Aborting...

attila123 commented on 2018-11-25 11:39

This one was last updated almost a year ago, and is flagged out-of-date for 2 months now. https://aur.archlinux.org/packages/megasync/ seems to be up-to-date currently.

adambot commented on 2017-10-05 19:15

will do -- thanks for the guidance!

sl1pkn07 commented on 2017-10-04 20:08

try with upstream bugtracker

https://github.com/meganz/MEGAsync/issues
https://github.com/meganz/sdk/issues

adambot commented on 2017-10-04 20:04

i get the following error when i try to build:

In file included from control/CrashHandler.cpp:15:0:
google_breakpad/client/linux/handler/exception_handler.h:192:21: error: field ‘context’ has incomplete type ‘google_breakpad::ucontext’
struct ucontext context;
^~~~~~~
google_breakpad/client/linux/handler/exception_handler.h:192:12: note: forward declaration of ‘struct google_breakpad::ucontext’
struct ucontext context;
^~~~~~~~
make: *** [Makefile:5282: CrashHandler.o] Error 1
==> ERROR: A failure occurred in build().
Aborting...
==> ERROR: Makepkg was unable to build megasync-git.

any help would be appreciated

sl1pkn07 commented on 2017-10-01 10:09

@greenbigfrog nothig to do here. reinstall and go (you need learn how git packages works)

greetings