Package Details: mcpelauncher-msa-git v0.1.beta.1.r10.g323bb82-1

Git Clone URL: https://aur.archlinux.org/mcpelauncher-msa-git.git (read-only, click to copy)
Package Base: mcpelauncher-msa-git
Description: Microsoft Account authentication daemon for mcpelauncher
Upstream URL: https://github.com/minecraft-linux/msa-manifest
Licenses: MIT
Conflicts: mcpelauncher-msa
Provides: mcpelauncher-msa
Submitter: mrarm
Maintainer: mrarm
Last Packager: mrarm
Votes: 2
Popularity: 0.000131
First Submitted: 2018-08-23 16:16
Last Updated: 2018-12-23 15:11

Latest Comments

xirxes commented on 2020-05-20 16:28

I definitely haven't been able to build recently either, found that they've stopped working on the packaging for Arch but there still is work being done. They have an appimage in their docs here, https://mcpelauncher.readthedocs.io/en/latest/getting_started.html and a working fork with the newest version of bedrock is here. https://github.com/ChristopherHX/linux-packaging-scripts/releases/tag/appimage

Matthew02 commented on 2020-05-13 11:58

Anybody else having trouble compiling this?

==> Starting build()...
CMake Warning (dev) in CMakeLists.txt:
  No project() command is present.  The top-level CMakeLists.txt file must
  contain a literal, direct call to the project() command.  Add a line of
  code such as

    project(ProjectName)

  near the top of the file, but after cmake_minimum_required().

  CMake is pretending there is a "project(Project)" command on the first
  line.
This warning is for project developers.  Use -Wno-dev to suppress it.

-- The C compiler identification is GNU 9.3.0
-- The CXX compiler identification is GNU 9.3.0
-- Check for working C compiler: /usr/bin/cc
-- Check for working C compiler: /usr/bin/cc - broken
CMake Error at /usr/share/cmake-3.17/Modules/CMakeTestCCompiler.cmake:60 (message):
  The C compiler

    "/usr/bin/cc"

  is not able to compile a simple test program.

  It fails with the following output:

    Change Dir: /home/user/.cache/yay/mcpelauncher-msa-git/src/msa-manifest/build/CMakeFiles/CMakeTmp

    Run Build Command(s):/usr/bin/make cmTC_4255c/fast && /usr/bin/make  -f CMakeFiles/cmTC_4255c.dir/build.make CMakeFiles/cmTC_4255c.dir/build
    make[1]: Entering directory '/home/user/.cache/yay/mcpelauncher-msa-git/src/msa-manifest/build/CMakeFiles/CMakeTmp'
    Building C object CMakeFiles/cmTC_4255c.dir/testCCompiler.c.o
    /usr/bin/cc   -D_FORTIFY_SOURCE=2 -02 -march=bdver1 -pipe    -o CMakeFiles/cmTC_4255c.dir/testCCompiler.c.o   -c /home/user/.cache/yay/mcpelauncher-msa-git/src/msa-manifest/build/CMakeFiles/CMakeTmp/testCCompiler.c
    cc: error: unrecognized command line option ‘-02’
    make[1]: *** [CMakeFiles/cmTC_4255c.dir/build.make:86: CMakeFiles/cmTC_4255c.dir/testCCompiler.c.o] Error 1
    make[1]: Leaving directory '/home/user/.cache/yay/mcpelauncher-msa-git/src/msa-manifest/build/CMakeFiles/CMakeTmp'
    make: *** [Makefile:141: cmTC_4255c/fast] Error 2





  CMake will not be able to correctly generate this project.


-- Configuring incomplete, errors occurred!
See also "/home/user/.cache/yay/mcpelauncher-msa-git/src/msa-manifest/build/CMakeFiles/CMakeOutput.log".
See also "/home/user/.cache/yay/mcpelauncher-msa-git/src/msa-manifest/build/CMakeFiles/CMakeError.log".
==> ERROR: A failure occurred in build().
    Aborting...
Error making: mcpelauncher-msa-git
[1]    550446 exit 1     yay -S mcpelauncher-msa-git mcpelauncher-msa-ui-qt-git mcpelauncher-linux-git
yay -S mcpelauncher-msa-git mcpelauncher-msa-ui-qt-git mcpelauncher-linux-git  20.19s user 4.27s system 22% cpu 1:50.06 total