Package Details: markdown-reader 1.1.1-1

Git Clone URL: https://aur.archlinux.org/markdown-reader.git (read-only)
Package Base: markdown-reader
Description: A document reader for markdown and html files
Upstream URL: https://github.com/BadWolfie
Licenses: GPL2
Submitter: badwolfie
Maintainer: badwolfie
Last Packager: badwolfie
Votes: 6
Popularity: 0.000000
First Submitted: 2015-05-14 21:44
Last Updated: 2015-07-06 03:13

Latest Comments

« First ‹ Previous 1 2

badwolfie commented on 2015-05-17 15:27

I'm really sorry archdria, I don't really know what's wrong. I asked some ppl to test the package and none had problems compiling it, are you sure it's not because of your computer? Do you get any other messages on the terminal before that error?

swiftscythe commented on 2015-05-16 11:08

Hi! Yes, I keep getting the same error:
make[4]: Leaving directory '/tmp/yaourt-tmp-adria/aur-markdown-reader/src/markdown-reader-1.1.0/src'
CC markdown_reader-markdown-reader.o
<command-line>:0:11: warning: missing whitespace after the macro name
mv: cannot stat ‘markdown_reader_vala.stamp-t’: No such file or directory
Makefile:546: recipe for target 'markdown_reader_vala.stamp' failed
make[4]: *** [markdown_reader_vala.stamp] Error 1
make[4]: Leaving directory '/tmp/yaourt-tmp-adria/aur-markdown-reader/src/markdown-reader-1.1.0/src'
Makefile:521: recipe for target 'document-tab.c' failed
make[3]: *** [document-tab.c] Error 2

Thank you

badwolfie commented on 2015-05-16 06:45

archdria I just updated the package, please let me know if you keep getting the same error (or any other).

Thnx so much for your feedback!

swiftscythe commented on 2015-05-15 08:18

I get this build error:
mv: cannot stat ‘markdown_reader_vala.stamp-t’: No such file or directory
Makefile:523: recipe for target 'markdown_reader_vala.stamp' failed
make[4]: *** [markdown_reader_vala.stamp] Error 1
make[4]: Leaving directory '/tmp/yaourt-tmp-adria/aur-markdown-reader/src/markdown-reader-1.0.0/src'
Makefile:518: recipe for target 'tab-bar.c' failed
make[3]: *** [tab-bar.c] Error 2