Package Details: livewallpaper-bzr 0.5.0.r333-1

Git Clone URL: https://aur.archlinux.org/livewallpaper-bzr.git (read-only, click to copy)
Package Base: livewallpaper-bzr
Description: OpenGL powered animated wallpapers with configuration utility, autostart, and application indicator.
Upstream URL: https://launchpad.net/livewallpaper
Keywords: background desktop live wallpaper
Licenses: GPL3
Replaces: livewallpaper
Submitter: Salamandar
Maintainer: Salamandar
Last Packager: Salamandar
Votes: 15
Popularity: 0.000094
First Submitted: 2019-02-02 19:19
Last Updated: 2019-02-02 19:19

Latest Comments

« First ‹ Previous 1 2 3 4 Next › Last »

Stellaris commented on 2017-08-18 09:12

Change the line
model.remove (it);
to
model.remove (ref it);

(update the sha256sum in the PKGBUILD accordingly)

DrDiablo commented on 2017-08-17 12:00

[ 47%] Built target translations-desktop
[ 47%] Generating resources.c
[ 48%] Generating application.c, files-selector.c, key.c, keyfactory.c, main.c, plugin-parser.c, plugin-store.c, range-selector.c, search.c, lw-ui.c, plugin.c, config.c
/tmp/yaourt-tmp-www/aur-livewallpaper/src/livewallpaper-0.5.0/ui/config/files-selector.vala:58.27-58.28: error: Argument 1: Cannot pass value to reference or output parameter
model.remove (it);
^^
Compilation failed: 1 error(s), 0 warning(s)
make[2]: *** [ui/config/CMakeFiles/livewallpaper-config.dir/build.make:73: ui/config/application.c] Ошибка 1
make[1]: *** [CMakeFiles/Makefile2:380: ui/config/CMakeFiles/livewallpaper-config.dir/all] Ошибка 2
make: *** [Makefile:130: all] Ошибка 2

UNIcodeX commented on 2017-06-24 04:45

My build attempt failed at the following:


...
^
[ 26%] Linking C executable livewallpaper
[ 26%] Built target livewallpaper
Scanning dependencies of target translations_1
[ 27%] Generating de.gmo
[ 28%] Generating es.gmo
[ 29%] Generating fr.gmo
[ 30%] Generating he.gmo
[ 31%] Generating hr.gmo
[ 32%] Generating it.gmo
[ 33%] Generating ja.gmo
[ 33%] Generating lt.gmo
[ 34%] Generating lv.gmo
[ 35%] Generating ms.gmo
[ 36%] Generating nl.gmo
[ 37%] Generating ru.gmo
[ 38%] Generating sk.gmo
[ 39%] Generating tr.gmo
[ 40%] Generating uk.gmo
[ 41%] Generating zh_CN.gmo
[ 41%] Built target translations_1
Scanning dependencies of target translations
[ 41%] Built target translations
Scanning dependencies of target translations-desktop
[ 42%] Generating livewallpaper.desktop
[ 43%] Generating livewallpaper-autostart.desktop
[ 44%] Generating livewallpaper-config.desktop
[ 44%] Generating livewallpaper-indicator.desktop
[ 45%] Generating livewallpaper-config.appdata.xml
[ 45%] Built target translations-desktop
[ 46%] Generating resources.c
[ 47%] Generating application.c, files-selector.c, key.c, keyfactory.c, main.c, plugin-parser.c, plugin-store.c, range-selector.c, search.c, lw-ui.c, plugin.c, config.c
/home/jared/repos/livewallpaper/src/livewallpaper/ui/config/files-selector.vala:58.27-58.28: error: Argument 1: Cannot pass value to reference or output parameter
model.remove (it);
^^
Compilation failed: 1 error(s), 0 warning(s)
make[2]: *** [ui/config/CMakeFiles/livewallpaper-config.dir/build.make:73: ui/config/application.c] Error 1
make[1]: *** [CMakeFiles/Makefile2:380: ui/config/CMakeFiles/livewallpaper-config.dir/all] Error 2
make: *** [Makefile:130: all] Error 2
==> ERROR: A failure occurred in build().
Aborting...

mrturcot commented on 2017-05-08 07:41

Made it to 66%...

[ 65%] Built target livewallpaper-indicator
[ 66%] Linking C shared library liblivewallpaper-core.so
[ 66%] Built target livewallpaper-core
make: *** [Makefile:130: all] Error 2
==> ERROR: A failure occurred in build().
Aborting...
==> ERROR: Makepkg was unable to build .
==> Restart building livewallpaper ? [y/N]
==> --------------------------------------

windmillnation commented on 2017-03-03 03:46

I too am facing seg fault on running it. On running gdb, the following is the result. Is there any known fix?

Starting program: /usr/bin/livewallpaper
[Thread debugging using libthread_db enabled]
Using host libthread_db library "/usr/lib/libthread_db.so.1".
[New Thread 0x7fffecf65700 (LWP 7634)]
[New Thread 0x7fffe7fff700 (LWP 7635)]
[New Thread 0x7fffe77fe700 (LWP 7636)]

** (livewallpaper:7630): CRITICAL **: Window creation failed: Could not find appropriate framebuffer configuration

Thread 1 "livewallpaper" received signal SIGSEGV, Segmentation fault.
0x00007ffff75dad62 in ?? () from /usr/lib/libgdk-3.so.0

jrd commented on 2016-12-31 10:18

The following runtime-deps are missing:
- python2-opengl
- python2-gobject

Also when executing in CLI, you have the following warning (which should be fixed upstream probably):

/usr/lib/livewallpaper/plugins/circles/circles.py:24: PyGIWarning: PangoCairo was imported without specifying a version first. Use gi.require_version('PangoCairo', '1.0') before import to ensure that the right version gets loaded.
from gi.repository import cairo, Pango, PangoCairo

Salamandar commented on 2016-12-19 11:21

I'm not the livewallpaper dev, so I can't really help you. Could you debug LW with gdb ?

dbeattyspace commented on 2016-12-19 04:00

I get a seg fault when I try to run, and switch won't flip in upper left of config. Tried reinstalling without success. No obvious problems in installation, any suggestions?

Salamandar commented on 2016-10-10 21:26

I removed the gtk-doc dependency (basically, CMake doesnt check for it anymore and the doc is not generated). Thx for the vala dep ^^
I also fixed some things such as and old API use and the non-dependency for python3.

SonOfHyde commented on 2016-10-10 01:03

DryEagle >
thx bro i install gtk-doc and works perfect