Package Details: litecoin-qt 0.18.1-1

Git Clone URL: https://aur.archlinux.org/litecoin-qt.git (read-only, click to copy)
Package Base: litecoin-qt
Description: Peer-to-peer network based digital currency (QT)
Upstream URL: http://www.litecoin.org/
Licenses: MIT
Conflicts: litecoin
Submitter: Flink
Maintainer: rpodgorny
Last Packager: rpodgorny
Votes: 82
Popularity: 0.096786
First Submitted: 2013-03-22 17:37
Last Updated: 2020-07-26 06:09

Latest Comments

1 2 3 4 5 6 Next › Last »

Raansu commented on 2021-05-13 01:00

Changing the link to "https://github.com/litecoin-project/litecoin/archive/refs/tags/v${pkgver}.tar.gz"

adding the current sha256sum of 2d67cba11adc5890b9698ccddeb68dd3c2ff6af19bf3ed0f1c719348b914042f

and then uncommenting the line for the icon in the PKGBUILD worked for me for the meantime. I don't know when or if they'll fix the tarball on their main page.

Raansu commented on 2021-05-13 00:03

I found out weirdly... The 0.18.1 tarball found at their site is missing the application icons but the similarly numbered release found here https://github.com/litecoin-project/litecoin/releases/tag/v0.18.1 has all of the icons in it. I have raised this issue to the litecoin github.

Raansu commented on 2021-05-12 22:42

Hi,

Is there a reason why the icon for this package is commented out?

rpodgorny commented on 2020-07-26 06:14

updated with the new patch. sorry for the delay.

rpodgorny commented on 2020-06-15 03:33

...can't really update the package now as it fails to compile. reported at https://github.com/litecoin-project/litecoin/issues/652

fredboy commented on 2020-06-04 02:03

Stopped working after protobuf update: litecoin-qt: error while loading shared libraries: libprotobuf.so.22: cannot open shared object file: No such file or directory

UPD: rebuilding the package helped

rpodgorny commented on 2020-02-03 11:45

@lucas: implemented. thanks!

lucas commented on 2020-02-03 11:01

Quick fix: add

include <deque>

at line 33 in httpserver.cpp

rpodgorny commented on 2020-02-03 09:27

no idea, upstream bug report issue - let's see...

https://github.com/litecoin-project/litecoin/issues/632

lucas commented on 2020-02-02 05:37

Can't compile Boost problems?

Making all in src make[1]: Entering directory '/home/luca/tmp/yaourt/yaourt-tmp-luca/aur-litecoin-qt/src/litecoin-0.17.1/src' make[2]: Entering directory '/home/luca/tmp/yaourt/yaourt-tmp-luca/aur-litecoin-qt/src/litecoin-0.17.1/src' CXX litecoind-bitcoind.o CXX libbitcoin_server_a-addrdb.o CXX libbitcoin_server_a-addrman.o CXX libbitcoin_server_a-bloom.o CXX libbitcoin_server_a-blockencodings.o CXX libbitcoin_server_a-chain.o CXX libbitcoin_server_a-checkpoints.o CXX consensus/libbitcoin_server_a-tx_verify.o CXX libbitcoin_server_a-httprpc.o CXX libbitcoin_server_a-httpserver.o httpserver.cpp:74:10: error: ‘deque’ in namespace ‘std’ does not name a template type 74 | std::deque<std::unique_ptr<WorkItem>> queue; | ^~~~~ httpserver.cpp:33:1: note: ‘std::deque’ is defined in header ‘<deque>’; did you forget to ‘#include <deque>’? 32 | #include <support/events.h> +++ |+#include <deque> 33 | httpserver.cpp: In member function ‘bool WorkQueue<WorkItem>::Enqueue(WorkItem)’: httpserver.cpp:92:13: error: ‘queue’ was not declared in this scope; did you mean ‘Enqueue’? 92 | if (queue.size() >= maxDepth) { | ^~~~~ | Enqueue httpserver.cpp:95:9: error: ‘queue’ was not declared in this scope; did you mean ‘Enqueue’? 95 | queue.emplace_back(std::unique_ptr<WorkItem>(item)); | ^~~~~ | Enqueue httpserver.cpp: In member function ‘void WorkQueue<WorkItem>::Run()’: httpserver.cpp:106:35: error: ‘queue’ was not declared in this scope; did you mean ‘Enqueue’? 106 | while (running && queue.empty()) | ^~~~~ | Enqueue httpserver.cpp:110:31: error: ‘queue’ was not declared in this scope; did you mean ‘Enqueue’? 110 | i = std::move(queue.front()); | ^~~~~ | Enqueue make[2]: [Makefile:6346: libbitcoin_server_a-httpserver.o] Error 1 make[2]: Leaving directory '/home/luca/tmp/yaourt/yaourt-tmp-luca/aur-litecoin-qt/src/litecoin-0.17.1/src' make[1]: [Makefile:10510: all-recursive] Error 1 make[1]: Leaving directory '/home/luca/tmp/yaourt/yaourt-tmp-luca/aur-litecoin-qt/src/litecoin-0.17.1/src' make: ** [Makefile:774: all-recursive] Error 1