Package Details: linuxcnc-sim 2.7.15-1

Git Clone URL: https://aur.archlinux.org/linuxcnc-sim.git (read-only, click to copy)
Package Base: linuxcnc-sim
Description: It can interpret G-code and simulate a CNC machine (formerly EMC2).
Upstream URL: http://linuxcnc.org/
Licenses: GPL2
Submitter: ivanovp
Maintainer: ivanovp
Last Packager: ivanovp
Votes: 13
Popularity: 0.005996
First Submitted: 2013-10-20 07:32
Last Updated: 2020-10-18 05:03

Latest Comments

« First ‹ Previous 1 2 3 4 5 Next › Last »

ivanovp commented on 2016-04-23 06:33

I've added a patch, but it is not finished: more work is needed...

TiaoHero commented on 2016-04-22 13:14

When i try convert a image to gcode i get the following error :

Traceback (most recent call last):
File "/usr/sbin/image-to-gcode", line 26, in <module>
import Image
ImportError: No module named Image

What can i do to solve this poblem ?

hexvalid commented on 2015-09-11 12:46

Checking for ID conflicts in stepconf glade files
File "../scripts/checkglade", line 41
print "%s:0: Uses id %r (first encountered in %s)" % (
^
SyntaxError: invalid syntax
emc/usr_intf/stepconf/Submakefile:22: recipe for target 'objects/glade-conflict-check-stamp' failed
make: *** [objects/glade-conflict-check-stamp] Error 1
== ERROR: A failure occurred in build().
Aborting...

71GA commented on 2015-09-11 06:33

Checking for ID conflicts in stepconf glade files
File "../scripts/checkglade", line 41
print "%s:0: Uses id %r (first encountered in %s)" % (
^
SyntaxError: invalid syntax
emc/usr_intf/stepconf/Submakefile:22: recipe for target 'objects/glade-conflict-check-stamp' failed
make: *** [objects/glade-conflict-check-stamp] Error 1
==> ERROR: A failure occurred in build().
Aborting...

ivanovp commented on 2015-04-05 06:44

@cox: I've adopted tclx and updated it.

ivanovp commented on 2015-03-03 07:10

@cox: Report this error to tclx.

cox commented on 2015-03-03 07:06

==> tclx dependencies:
- tk (already installed)
- tcl=8.6.2 (building from AUR)

==> Continue building tclx ? [Y/n]
==> ------------------------------
==>
==> Building and installing package
==> Install or build missing dependencies for tclx:
error: target not found: tcl=8.6.2

ivanovp commented on 2014-10-22 05:16

I got this error, when I switched on the machine (axis):

TCL error in asynchronous code:
wrong # args: should be ".toolbar.program_step cmd ?arg ...?"
while executing
".toolbar.program_step"
invoked from within
"if {$::last_interp_state != $::INTERP_IDLE || $::last_task_state != $::task_state} {
set_mode_from_tab
}"
(procedure "update_state" line 44)
invoked from within
"update_state"
("after" script)

gscreen is working (I'm not familiar with this).

andrew2085 commented on 2014-10-21 22:09

To get it to compile line 132 in rs274ngc_pre.cc needs to be change from:
_setup.pythis = boost::python::object(boost::cref(this));

to:
_setup.pythis = boost::python::object(boost::cref(*this));

This should be fixed in linuxcnc, it used to work because boost::cref used to allow passing an r-value reference (it shouldn't have). There could be more to this, I haven't checked the code more, so it could just crash at some point while it's running.

71GA commented on 2014-10-06 13:01

This won't compile.

Makefile:207: recipe for target 'objects/emc/rs274ngc/rs274ngc_pre.o' failed
make: *** [objects/emc/rs274ngc/rs274ngc_pre.o] Error 1