Package Details: lime-git 4.5.0.alpha.r13.g550515b-1

Git Clone URL: https://aur.archlinux.org/lime-git.git (read-only, click to copy)
Package Base: lime-git
Description: C++ library implementing Open Whisper System Signal protocol
Upstream URL: http://www.linphone.org/
Licenses: GPL
Conflicts: lime
Provides: lime=4.5.0.alpha.r13.g550515b
Submitter: thrasibule
Maintainer: thrasibule
Last Packager: thrasibule
Votes: 0
Popularity: 0.000000
First Submitted: 2019-01-12 22:43
Last Updated: 2020-12-19 21:27

Dependencies (4)

Required by (2)

Sources (1)

Latest Comments

Manifest0 commented on 2020-12-17 22:53

@zsolta-donca

please rebuild soci with option "-DSOCI_CXX11=ON" on the cmake:

https://github.com/SOCI/soci/issues/792

I added a comment in the soci-git for the pkgbuild to be updated.

zsolt-donca commented on 2020-12-14 12:18

This package and the related package lime fail to build for me:

[ 11%] Building CXX object src/CMakeFiles/lime.dir/lime.cpp.o
In file included from /usr/include/soci/soci.h:12,
                 from /home/zdonca/.cache/yay/lime-git/src/lime/src/lime_localStorage.hpp:23,
                 from /home/zdonca/.cache/yay/lime-git/src/lime/src/lime_impl.hpp:31,
                 from /home/zdonca/.cache/yay/lime-git/src/lime/src/lime.cpp:22:
/usr/include/soci/soci-platform.h:146:10: error: #error "SOCI must be configured with C++11 support when using C++11"
  146 |         #error "SOCI must be configured with C++11 support when using C++11"
      |          ^~~~~
make[2]: *** [src/CMakeFiles/lime.dir/build.make:82: src/CMakeFiles/lime.dir/lime.cpp.o] Error 1
make[1]: *** [CMakeFiles/Makefile2:134: src/CMakeFiles/lime.dir/all] Error 2
make: *** [Makefile:149: all] Error 2
==> ERROR: A failure occurred in build().
    Aborting...
error making: lime-git

Any ideas on how to fix this?

postfinem commented on 2020-07-25 03:07

I get
```
/home/user/downloads/aur/lime-git/src/lime/src/lime_crypto_primitives.cpp:22:10: fatal error: bctoolbox/crypto.hh: No such file or directory
22 | #include "bctoolbox/crypto.hh"
| ^~~~~~~~~~~~~~~~~~~~~
compilation terminated.
make[2]: *** [src/CMakeFiles/lime.dir/build.make:95: src/CMakeFiles/lime.dir/lime_crypto_primitives.cpp.o] Error 1
make[1]: *** [CMakeFiles/Makefile2:162: src/CMakeFiles/lime.dir/all] Error 2
make: *** [Makefile:149: all] Error 2
```

thrasibule commented on 2020-06-14 02:06

@SolarAquarion Where do you see that?

SolarAquarion commented on 2020-06-09 01:27

boost is a makedepend