Package Details: libwnck+-git 2.31.0.r22.g129f5dc-1

Git Clone URL: https://aur.archlinux.org/libwnck+-git.git (read-only)
Package Base: libwnck+-git
Description: Window Navigator Construction Kit
Upstream URL: https://github.com/bbidulock/libwnck
Licenses: LGPL
Conflicts: libwnck, libwnck+
Provides: libwnck=2.31.0, libwnck+=2.31.0
Submitter: bidulock
Maintainer: bidulock
Last Packager: bidulock
Votes: 3
Popularity: 0.000000
First Submitted: 2014-06-17 02:11
Last Updated: 2018-03-25 05:54

Required by (45)

Sources (1)

Latest Comments

bidulock commented on 2018-03-25 05:58

Issue was with gtk-doc. r22 builds correct in clean chroot on up to date system.

milk commented on 2018-03-25 03:58

PKGBUILD is missing ./configure

that and ./autogen.sh should be in prepare()

also, the two mv in the package() are for files that don't exist

milk commented on 2018-03-21 17:45

Having an issue building this atm;

make[2]: Leaving directory '/var/tmp/trizen-milk/libwnck+-git/src/libwnck+-git/libwnck'
Making all in doc
make[2]: Entering directory '/var/tmp/trizen-milk/libwnck+-git/src/libwnck+-git/doc'
  DOC   Scanning header files
  DOC   Introspecting gobjects
usage: gtkdoc-scangobj [-h] [--version] --module MODULE [--types TYPES] [--type-init-func TYPE_INIT_FUNC] [--query-child-properties QUERY_CHILD_PROPERTIES]
                       [--output-dir OUTPUT_DIR] [--cc CC] [--ld LD] [--cflags CFLAGS] [--ldflags LDFLAGS] [--run RUN] [--verbose]
gtkdoc-scangobj: error: unrecognized arguments: --nogtkinit
make[2]: *** [Makefile:694: scan-build.stamp] Error 2
make[2]: Leaving directory '/var/tmp/trizen-milk/libwnck+-git/src/libwnck+-git/doc'
make[1]: *** [Makefile:556: all-recursive] Error 1
make[1]: Leaving directory '/var/tmp/trizen-milk/libwnck+-git/src/libwnck+-git'
make: *** [Makefile:463: all] Error 2
==> ERROR: A failure occurred in build().
    Aborting...