Package Details: libresprite 1.1.7-1

Git Clone URL: https://aur.archlinux.org/libresprite.git (read-only, click to copy)
Package Base: libresprite
Description: fork of last GPL version of aseprite
Upstream URL: https://github.com/LibreSprite/LibreSprite
Keywords: gamedev pixel sprites
Licenses: GPL
Conflicts: aseprite, aseprite-git, aseprite-gpl
Submitter: bell0x07
Maintainer: MintStudios
Last Packager: bell0x07
Votes: 8
Popularity: 1.26
First Submitted: 2018-06-19 10:54
Last Updated: 2018-06-19 10:54

Latest Comments

Tio commented on 2020-10-31 19:08

Error:

make[3]: *** [src/she/CMakeFiles/she.dir/build.make:121: src/she/CMakeFiles/she.dir/alleg4/display_events.cpp.o] Error 1
make[3]: *** [src/she/CMakeFiles/she.dir/build.make:134: src/she/CMakeFiles/she.dir/alleg4/key_poller.cpp.o] Error 1
make[3]: *** [src/she/CMakeFiles/she.dir/build.make:108: src/she/CMakeFiles/she.dir/alleg4/alleg_surface.cpp.o] Error 1
make[3]: *** [src/she/CMakeFiles/she.dir/build.make:160: src/she/CMakeFiles/she.dir/alleg4/she.cpp.o] Error 1
make[3]: *** [src/she/CMakeFiles/she.dir/build.make:95: src/she/CMakeFiles/she.dir/alleg4/alleg_display.cpp.o] Error 1
make[2]: *** [CMakeFiles/Makefile2:1129: src/she/CMakeFiles/she.dir/all] Error 2
make[2]: *** Waiting for unfinished jobs....
[ 37%] Linking C static library ../../lib/libduktape.a
[ 37%] Built target duktape
make[1]: *** [CMakeFiles/Makefile2:625: src/CMakeFiles/aseprite.dir/rule] Error 2
make: *** [Makefile:194: aseprite] Error 2
==> ERROR: A failure occurred in build().
    Aborting...

MintStudios commented on 2020-10-16 15:17

I've just adopted this package, I'm redoing this now.

FFY00 commented on 2020-10-16 14:17

Please do not use git submodule update --init --recursive.

Refeer to https://wiki.archlinux.org/index.php/VCS_package_guidelines#Git_Submodules for the guidelines and an example how to use submodules correctly.

SpotlightKid commented on 2020-09-30 21:32

@Ev1lbl0w: if it installs files with the same name/path as aseprite, it has to declare the conflict.

Ev1lbl0w commented on 2020-07-07 10:42

Hi, this package shouldn't conflict with any other aseprite package, since it's not meant to replace them.

archmkr commented on 2019-12-26 04:57

Hi, I got the same error from gogoprog. To solve it I compile it from master.

Here a gist of my modified pkgbuild file: https://gist.github.com/joaoantoniocardoso/701ba153510095ad589f8c90bee1b563

gogoprog commented on 2019-03-21 09:45

This is what I get when compiling:

/home/gogoprog/.cache/yay/libresprite/src/LibreSprite/src/allegro/include/allegro/alcompat.h:44:22: error: conflicting declaration of C function ‘fixed fadd(fixed, fixed)’
       AL_ALIAS(fixed fadd(fixed x, fixed y), fixadd(x, y))

hollunder commented on 2016-12-20 11:41

-- Found Threads: TRUE
CMake Error at /usr/share/cmake-3.6/Modules/FindX11.cmake:439 (message):
Could not find X11
Call Stack (most recent call first):
CMakeLists.txt:340 (find_package)

I guess it is either a bug in the cmake script or a bulddependency on some X11 stuff is missing.

hollunder commented on 2016-12-20 11:10

Build failure, I guess git is missing from the makedepends.

==> Validating source files with sha256sums...
aseprite ... Skipped
aseprite.desktop ... Passed
==> ERROR: Cannot find the git package needed to handle git sources.

==> ERROR: An unknown error has occurred. Exiting...
==> ERROR: Build failed, check /var/lib/aurbuild/x86_64/murks/build