Package Details: libglade 2.6.4-7

Git Clone URL: https://aur.archlinux.org/libglade.git (read-only, click to copy)
Package Base: libglade
Description: Allows you to load glade interface files in a program at runtime
Upstream URL: http://www.gnome.org
Licenses: LGPL
Submitter: yan12125
Maintainer: xuanruiqi
Last Packager: yan12125
Votes: 21
Popularity: 14.22
First Submitted: 2021-05-13 12:47
Last Updated: 2021-05-13 12:47

Dependencies (5)

Sources (2)

Latest Comments

katt commented on 2021-06-02 21:49

Fails to build with LTO, could options=(!lto) be added? I assume no one wants to work on this old piece of software :p

 gcc -DHAVE_CONFIG_H -I. -I.. -DG_LOG_DOMAIN=\"libglade\" -I.. -I/usr/include/libxml2 -I/usr/include/atk-1.0 -I/usr/include/glib-2.0 -I/usr/lib/glib-2.0/include -I/usr/include/gtk-2.0 -I/usr/lib/gtk-2.0/include -I/usr/include/pango-1.0 -I/usr/include/harfbuzz -I/usr/include/freetype2 -I/usr/include/libpng16 -I/usr/include/libmount -I/usr/include/blkid -I/usr/include/fribidi -I/usr/include/cairo -I/usr/include/lzo -I/usr/include/pixman-1 -I/usr/include/gdk-pixbuf-2.0 -pthread -DGLADE_LIBDIR=\"/usr/lib\" -DGLADE_PREFIX=\"/usr\" -DG_DISABLE_DEPRECATED -DGDK_DISABLE_DEPRECATED -DGDK_PIXBUF_DISABLE_DEPRECATED -DGNOME_DISABLE_DEPRECATED -march=x86-64 -mtune=generic -O2 -pipe -fno-plt -fexceptions -Wp,-D_FORTIFY_SOURCE=2 -Wformat -Werror=format-security -fstack-clash-protection -fcf-protection -g -fvar-tracking-assignments -fdebug-prefix-map=/build/libglade/src=/usr/src/debug -flto -Wall -std=c9x -MT glade-parser.lo -MD -MP -MF .deps/glade-parser.Tpo -c glade-parser.c -o glade-parser.o >/dev/null 2>&1
mv -f .deps/glade-init.Tpo .deps/glade-init.Plo
mv -f .deps/glade-gtk.Tpo .deps/glade-gtk.Plo
mv -f .deps/glade-xml.Tpo .deps/glade-xml.Plo
mv -f .deps/glade-parser.Tpo .deps/glade-parser.Plo
/bin/sh ../libtool --tag=CC   --mode=link gcc  -march=x86-64 -mtune=generic -O2 -pipe -fno-plt -fexceptions         -Wp,-D_FORTIFY_SOURCE=2 -Wformat -Werror=format-security         -fstack-clash-protection -fcf-protection -g -fvar-tracking-assignments -fdebug-prefix-map=/build/libglade/src=/usr/src/debug -flto -Wall -std=c9x -version-info 0:7:0 -export-symbols-regex "^[^_].*" -no-undefined -Wl,-O1,--sort-common,--as-needed,-z,relro,-z,now -o libglade-2.0.la -rpath /usr/lib glade-init.lo glade-xml.lo glade-parser.lo glade-gtk.lo -lxml2 -lgtk-x11-2.0 -lgdk-x11-2.0 -lpangocairo-1.0 -latk-1.0 -lcairo -lgdk_pixbuf-2.0 -lgio-2.0 -lpangoft2-1.0 -lpango-1.0 -lgobject-2.0 -lharfbuzz -lfontconfig -lfreetype -lglib-2.0  
generating symbol list for `libglade-2.0.la'
/usr/bin/nm -B  .libs/glade-init.o .libs/glade-xml.o .libs/glade-parser.o .libs/glade-gtk.o  |  | /usr/bin/sed 's/.* //' | sort | uniq > .libs/libglade-2.0.exp
../libtool: eval: line 4373: syntax error near unexpected token `|'
../libtool: eval: line 4373: `/usr/bin/nm -B  .libs/glade-init.o .libs/glade-xml.o .libs/glade-parser.o .libs/glade-gtk.o  |  | /usr/bin/sed 's/.* //' | sort | uniq > .libs/libglade-2.0.exp'
make[2]: *** [Makefile:329: libglade-2.0.la] Error 2
make[2]: Leaving directory '/build/libglade/src/libglade-2.6.4/glade'
make[1]: *** [Makefile:457: all-recursive] Error 1
make[1]: Leaving directory '/build/libglade/src/libglade-2.6.4'
make: *** [Makefile:284: all] Error 2
==> ERROR: A failure occurred in build().
    Aborting...
==> ERROR: Build failed, check /var/lib/aurbuild/x86_64/katt/build