Package Details: lib32-tk 8.6.9-1

Git Clone URL: (read-only, click to copy)
Package Base: lib32-tk
Description: A windowing toolkit for use with tcl
Upstream URL:
Licenses: custom
Submitter: yuyichao
Maintainer: dude
Last Packager: GordonGR
Votes: 30
Popularity: 0.000548
First Submitted: 2014-10-23 18:04
Last Updated: 2018-11-18 14:51

Latest Comments

1 2 3 Next › Last »

GordonGR commented on 2019-01-12 15:11

It builds fine here. I recommend you rebuild all your dependencies and make sure you have the base-devel installed.

vidar commented on 2019-01-09 17:00

I'm having following error when I try to build lib32-tk 8.6.9-1:

gcc: error: 8.6": No such file or directory gcc: error: attribute((visibility("hidden"))): No such file or directory gcc: error: long: No such file or directory make: *** [Makefile:1161: tkStubLib.o] Error 1

Error occurs right after make has finished checking prerequisites and gcc starts building.

My system is up-to-date

aaronp commented on 2016-08-23 04:13

Grabbing the PKGBUILD from the abs and removing line 44 seems to work in the meantime. I'm sure it probably breaks something else and could probably make your computer catch on fire, so don't do that. But I can't stop you if you do. But don't do it.

GordonGR commented on 2016-08-22 17:01

I sent a bug report to the maintainer of multilib/lib32-tcl, asking him to retain the /usr/lib32/libtclstub8.6.a. That should fix the issue. So, we wait.

Maverick commented on 2016-08-22 13:21

Having the same problem here as prMoriarty (fresh arch installation, installing via yaourt).

GordonGR commented on 2016-08-21 12:49

It builds perfectly fine here, using /usr/lib/libtclstub8.6.a, and the result is 32bits as it should. I don't understand.

prMoriarty commented on 2016-08-20 20:07

/usr/bin/ld: skipping incompatible /usr/lib/gcc/x86_64-pc-linux-gnu/6.1.1/../../../libtclstub8.6.a when searching for -ltclstub8.6
/usr/bin/ld: skipping incompatible /usr/lib/libtclstub8.6.a when searching for -ltclstub8.6
cannot find -ltclstub

GordonGR commented on 2016-05-22 16:17

Fixed. Thank you.

Tom_G commented on 2016-05-22 11:10

I had the same build problem as johnelros. It is caused by the LDFLAGS parameter and can be seen in the error line below. Adding a space before the -L fixed it for me.
/usr/bin/ld: invalid hash style `gnu-L/usr/lib32'

diff --git a/PKGBUILD b/PKGBUILD
index d85e1c0..66d6289 100644
@@ -19,7 +19,7 @@ cd tk${pkgver}/unix
export CC='gcc -m32'
export CXX='g++ -m32'
export PKG_CONFIG_PATH="/usr/lib32/pkgconfig"
-export LDFLAGS+='-L/usr/lib32'
+export LDFLAGS+=' -L/usr/lib32'
./configure --prefix=/usr --mandir=/usr/share/man \
--enable-threads --disable-rpath \
--libdir=/usr/lib32 \

rafaelff commented on 2016-03-20 19:07

No problem at all, this things happens. Thanks for fixing it.