Package Details: lib32-spirv-tools 2020.4-1

Git Clone URL: https://aur.archlinux.org/lib32-spirv-tools.git (read-only, click to copy)
Package Base: lib32-spirv-tools
Description: API and commands for processing SPIR-V modules
Upstream URL: https://www.khronos.org/vulkan
Licenses: custom
Groups: vulkan-devel
Submitter: sl1pkn07
Maintainer: kescherAUR
Last Packager: kescherAUR
Votes: 3
Popularity: 1.47
First Submitted: 2018-10-02 13:37
Last Updated: 2020-09-04 19:39

Latest Comments

kescherAUR commented on 2020-06-01 18:39

I have adopted the package, and bumped pkgver.

nines commented on 2020-05-12 19:51

Until it gets updated (if it does), assuming you're using yay yay --editmenu -S lib32-spirv-tools on edit change the pkgver. Current atm is pkgver=2020.2

oxalin commented on 2020-05-02 00:11

Any chance to have an updated version soon?

mozo commented on 2020-03-28 18:07

@kngwyu Yes, it works, thank you :)

kngwyu commented on 2020-03-18 13:44

@kescherAUR Changing line 20 from

        'git+https://github.com/KhronosGroup/SPIRV-Headers.git'

to

        'git+https://github.com/KhronosGroup/SPIRV-Headers.git#tag=1.5.1.corrected'

worked for me.

kescherAUR commented on 2020-03-17 17:33

Build in clean chroot fails for me.

In file included from /build/lib32-spirv-tools/src/SPIRV-Tools/source/operand.cpp:31:
/build/lib32-spirv-tools/src/build/operand.kinds-unified1.inc:999:4: error: ‘SPV_OPERAND_TYPE_RAY_FLAGS’ was not declared in this scope; did you mean ‘SPV_OPERAND_TYPE_IMAGE’?
  999 |   {SPV_OPERAND_TYPE_RAY_FLAGS, ARRAY_SIZE(pygen_variable_RayFlagsEntries), pygen_variable_RayFlagsEntries},
      |    ^~~~~~~~~~~~~~~~~~~~~~~~~~
      |    SPV_OPERAND_TYPE_IMAGE
/build/lib32-spirv-tools/src/build/operand.kinds-unified1.inc:1022:4: error: ‘SPV_OPERAND_TYPE_RAY_QUERY_INTERSECTION’ was not declared in this scope
 1022 |   {SPV_OPERAND_TYPE_RAY_QUERY_INTERSECTION, ARRAY_SIZE(pygen_variable_RayQueryIntersectionEntries), pygen_variable_RayQueryIntersectionEntries},
      |    ^~~~~~~~~~~~~~~~~~~~~~~~~~~~~~~~~~~~~~~
/build/lib32-spirv-tools/src/build/operand.kinds-unified1.inc:1023:4: error: ‘SPV_OPERAND_TYPE_RAY_QUERY_COMMITTED_INTERSECTION_TYPE’ was not declared in this scope
 1023 |   {SPV_OPERAND_TYPE_RAY_QUERY_COMMITTED_INTERSECTION_TYPE, ARRAY_SIZE(pygen_variable_RayQueryCommittedIntersectionTypeEntries), pygen_variable_RayQueryCommittedIntersectionTypeEntries},
      |    ^~~~~~~~~~~~~~~~~~~~~~~~~~~~~~~~~~~~~~~~~~~~~~~~~~~~~~
/build/lib32-spirv-tools/src/build/operand.kinds-unified1.inc:1024:4: error: ‘SPV_OPERAND_TYPE_RAY_QUERY_CANDIDATE_INTERSECTION_TYPE’ was not declared in this scope
 1024 |   {SPV_OPERAND_TYPE_RAY_QUERY_CANDIDATE_INTERSECTION_TYPE, ARRAY_SIZE(pygen_variable_RayQueryCandidateIntersectionTypeEntries), pygen_variable_RayQueryCandidateIntersectionTypeEntries},
      |    ^~~~~~~~~~~~~~~~~~~~~~~~~~~~~~~~~~~~~~~~~~~~~~~~~~~~~~
make[2]: *** [source/CMakeFiles/SPIRV-Tools.dir/build.make:237: source/CMakeFiles/SPIRV-Tools.dir/operand.cpp.o] Error 1
make[2]: *** Waiting for unfinished jobs....
make[2]: Leaving directory '/build/lib32-spirv-tools/src/build'
make[1]: *** [CMakeFiles/Makefile2:635: source/CMakeFiles/SPIRV-Tools.dir/all] Error 2
make[1]: Leaving directory '/build/lib32-spirv-tools/src/build'
make: *** [Makefile:141: all] Error 2
==> ERROR: A failure occurred in build().
    Aborting...
==> ERROR: Build failed, check /var/lib/archbuild/multilib-x86_64/kescher/build