Package Details: lib32-gstreamer0.10

Git Clone URL: (read-only, click to copy)
Package Base: lib32-gstreamer0.10
Description: GStreamer Multimedia Framework
Upstream URL:
Licenses: LGPL
Submitter: alucryd
Maintainer: asm0dey
Last Packager: asm0dey
Votes: 40
Popularity: 0.006952
First Submitted: 2014-09-22 09:10
Last Updated: 2020-10-30 21:40

Latest Comments

1 2 3 Next › Last »

MarsSeed commented on 2020-10-30 22:23

@asm0dey Thanks, build works flawlessly now! :)

asm0dey commented on 2020-10-30 21:40


MarsSeed commented on 2020-10-30 21:32

Missing make dependency: flex. Cannot build. (Build successful if I install flex beforehand.)

asm0dey commented on 2019-03-18 09:04

Also, if you;ll look into PKGBUILD you'll find python2 makedep

asm0dey commented on 2019-03-18 09:02

@jaysee I'm unsure why it doesn't build for you in chroot, but it's built for me inside this image, which is evidence that there is everything needed in base arch + yay AUR helper

jaysee commented on 2019-03-17 16:43

Missing dependency python. Cannot build in a chroot.

make[1]: Entering directory '/build/lib32-gstreamer0.10/src/gstreamer'
Making all in pkgconfig
make[2]: Entering directory '/build/lib32-gstreamer0.10/src/gstreamer/pkgconfig'
  CP     gstreamer-0.10.pc
  CP     gstreamer-check-0.10.pc
  CP     gstreamer-base-0.10.pc
  CP     gstreamer-controller-0.10.pc
  CP     gstreamer-dataprotocol-0.10.pc
  CP     gstreamer-net-0.10.pc
  CP     gstreamer-0.10-uninstalled.pc
  CP     gstreamer-controller-0.10-uninstalled.pc
  CP     gstreamer-dataprotocol-0.10-uninstalled.pc
  CP     gstreamer-net-0.10-uninstalled.pc
  CP     gstreamer-base-0.10-uninstalled.pc
  CP     gstreamer-check-0.10-uninstalled.pc
make[2]: Leaving directory '/build/lib32-gstreamer0.10/src/gstreamer/pkgconfig'
Making all in gst
make[2]: Entering directory '/build/lib32-gstreamer0.10/src/gstreamer/gst'
  GEN      gstenumtypes.h
  GEN      gstenumtypes.c
  GEN      gstmarshal.h
  GEN      gstmarshal.c
/usr/bin/env: ‘python3’: No such file or directory
/usr/bin/env: ‘python3’: No such file or directory
/usr/bin/env: make[2]: *** [Makefile:1999: gstenumtypes.h] Error 127
‘python3’: No such file or directorymake[2]: *** Waiting for unfinished jobs....
make[2]: *** [Makefile:2007: gstenumtypes.c] Error 127

make[2]: *** [Makefile:1988: gstmarshal.h] Error 127
/usr/bin/env: ‘python3’: No such file or directory
make[2]: *** [Makefile:1992: gstmarshal.c] Error 127
make[2]: Leaving directory '/build/lib32-gstreamer0.10/src/gstreamer/gst'
make[1]: *** [Makefile:751: all-recursive] Error 1
make[1]: Leaving directory '/build/lib32-gstreamer0.10/src/gstreamer'
make: *** [Makefile:655: all] Error 2
==> ERROR: A failure occurred in build().
==> ERROR: Build failed, check /home/build/aur-builder/chroot/538617/build/build
Error executing command: makechrootpkg -c -r /home/build/aur-builder/chroot/538617

asm0dey commented on 2018-06-03 12:07

To fix issues I propose to use following patch do PKGBUILD:

--- PKGBUILD.old    2018-06-03 15:06:57.386765557 +0300
+++ PKGBUILD    2018-06-03 15:06:28.806765862 +0300
@@ -8,20 +8,18 @@
-depends=('gstreamer0.10' 'lib32-glib2' 'lib32-libxml2')
+depends=('gstreamer0.10' 'lib32-glib2' 'lib32-libxml2' 'gtk-doc')
 makedepends=('gcc-multilib' 'git' 'intltool' 'python2')
-        'bison3.patch')
+        'git://')
-            'ed154e280abf59b24d98a8ab0fe868b449b26aa61f7ae3813fab8ac615fcaefa')
+            'SKIP')

 prepare() {
   cd gstreamer
-  patch -Np1 -i ../bison3.patch
+  git submodule init
+  git config submodule.common.url $srcdir/common
+  git submodule update

 build() {
@@ -30,7 +28,7 @@
   export CC='gcc -m32'
   export CXX='g++ -m32'
   export PKG_CONFIG_PATH='/usr/lib32/pkgconfig'
+  ./
   ./configure \
     --prefix='/usr' \
     --libdir='/usr/lib32' \
@@ -54,4 +52,3 @@

 # vim: ts=2 sw=2 et:

asm0dey commented on 2018-06-03 11:39

It looks like git repository doesn't exist anymore

Cloning into bare repository '/tmp/finkel/trizen-finkel/lib32-gstreamer0.10/gstreamer'...
fatal: repository '' not found

Kppqju77 commented on 2017-02-27 15:56

git retrieval is really long for me, making it almost impossible to build...

I switched to your repo alucryd, it is much easier that way, thank you.

alucryd commented on 2015-11-05 17:22

Bison is part of base-devel, you're supposed to have it installed.