Package Details: lib32-gst-plugins-bad 1.16.2-1

Git Clone URL: (read-only, click to copy)
Package Base: lib32-gst-plugins-bad
Description: GStreamer open-source multimedia framework bad plugins (32-bit)
Upstream URL:
Licenses: LGPL
Submitter: orumin
Maintainer: rodrigo21
Last Packager: rodrigo21
Votes: 14
Popularity: 0.27
First Submitted: 2016-06-11 18:11
Last Updated: 2020-01-04 18:54

Latest Comments

1 2 3 4 5 6 Next › Last »

tjackson commented on 2020-01-05 02:11

I'm hitting the issue with the elements_shm test failing too. I guess someone reported it already a while ago but got no response:

gverm commented on 2019-12-01 14:50

Newest update fails to install due to the elements_shm tests failing.

travelskid commented on 2019-06-02 15:05

can't install "lib32-webrtc-audio-processing" because "" is off

rodrigo21 commented on 2019-01-20 01:51

@DarkShadow44 @Nocifer

Added lib32-liblrdf as a dependency and disabled directfb plugin.

Nocifer commented on 2019-01-19 22:32

I was also hit with an error about a missing lib32-liblrdf:

make -C ladspa
make[3]: Entering directory '/home/nocifer/.cache/yay/lib32-gst-plugins-bad/src/gst-plugins-bad/ext/ladspa'
  CC       libgstladspa_la-gstladspautils.lo
  CC       libgstladspa_la-gstladspafilter.lo
  CC       libgstladspa_la-gstladspasource.lo
  CC       libgstladspa_la-gstladspasink.lo
  CC       libgstladspa_la-gstladspa.lo
/usr/bin/ld: skipping incompatible /usr/lib/gcc/x86_64-pc-linux-gnu/8.2.1/../../../ when searching for -llrdf
/usr/bin/ld: skipping incompatible /usr/lib/ when searching for -llrdf
/usr/bin/ld: cannot find -llrdf
collect2: error: ld returned 1 exit status
make[3]: *** [Makefile:851:] Error 1
make[3]: Leaving directory '/home/nocifer/.cache/yay/lib32-gst-plugins-bad/src/gst-plugins-bad/ext/ladspa'
make[2]: *** [Makefile:1315: ladspa] Error 2
make[2]: Leaving directory '/home/nocifer/.cache/yay/lib32-gst-plugins-bad/src/gst-plugins-bad/ext'
make[1]: *** [Makefile:951: all-recursive] Error 1
make[1]: Leaving directory '/home/nocifer/.cache/yay/lib32-gst-plugins-bad/src/gst-plugins-bad'
make: *** [Makefile:882: all] Error 2
==> ERROR: A failure occurred in build().

Installing that package fixed the error and I managed to build successfully. Curiously though, I never encountered any errors about lib32-directfb like @DarkShadow44 did, despite it not being installed on my system. And meanwhile @rodrigo21 can successfully build without either of these two packages... Strange, to say the least :P

Umbralump commented on 2019-01-15 04:08

@DarkShadow44 finally i can build now. Thanks

DarkShadow44 commented on 2019-01-14 12:48

@Umbralump See the last two comments. You can use my patch in the meantime.

Umbralump commented on 2019-01-14 05:15

Doesn't build for me anymore

gstfdkaacenc.c:74:8: error: ‘MODE_2_1’ undeclared here (not in a function); did you mean ‘MODE_6_1’? 3, MODE_2_1, { ^~~~~~~~ MODE_6_1 make[3]: *** [Makefile:874: libgstfdkaac_la-gstfdkaacenc.lo] Error 1

maybe is the problem of lib32-libfdk-aac?

rodrigo21 commented on 2019-01-13 21:34

@DarkShadow44 I already have a updated lib32-libfdk-aac package which fix this error. I'm just waiting for my orphan request to be accepted.

I can build it without lib32-liblrdf and lib32-directfb.

DarkShadow44 commented on 2019-01-13 20:10

Needs both lib32-liblrdf and lib32-directfb for me. Also needs a patch for aac:

Mind merging these changes?