Package Details: lib32-gamemode 1.4-3

Git Clone URL: https://aur.archlinux.org/lib32-gamemode.git (read-only)
Package Base: lib32-gamemode
Description: A daemon/lib combo for Linux that allows games to request a set of optimisations be temporarily applied to the host OS
Upstream URL: https://github.com/FeralInteractive/gamemode.git
Licenses: BSD 3-Clause License (Revised)
Submitter: ysblokje
Maintainer: ysblokje
Last Packager: ysblokje
Votes: 19
Popularity: 3.469950
First Submitted: 2018-04-11 10:56
Last Updated: 2019-07-21 18:32

Latest Comments

erkexzcx commented on 2019-08-31 14:13

@yochananmarqos nevermind. That was actually my bad.

My system was just so outdated (about 1 month) that I just updated everything, changed kernel, performed several reboots, removed all orphans and reinstalled every package. After final reboot everything was working fine and this package lib32-gamemode installed just fine.

yochananmarqos commented on 2019-08-31 14:08

@erkexzcx Try makepkg -C to clean build it.

erkexzcx commented on 2019-08-31 13:11

Doesn't build on my machine:

==> Starting build()...
Directory already configured.

Just run your build command (e.g. ninja) and Meson will regenerate as necessary.
If ninja fails, run "ninja reconfigure" or "meson --reconfigure"
to force Meson to regenerate.

If build failures persist, run "meson setup --wipe" to rebuild from scratch
using the same options as passed when configuring the build.
To change option values, run "meson configure" instead.
ninja: Entering directory `build'
[1/1] Linking target lib/libgamemode.so.0.0.0.
FAILED: lib/libgamemode.so.0.0.0 
cc  -o lib/libgamemode.so.0.0.0 'lib/76b5a35@@gamemode@sha/client_impl.c.o' -Wl,--no-undefined -Wl,--as-needed -shared -fPIC -Wl,--start-group -Wl,-soname,libgamemode.so.0 -m32 -Wl,-O1,--sort-common,--as-needed,-z,relro,-z,now /usr/lib/libdbus-1.so -Wl,--end-group
/usr/bin/ld: /usr/lib/libdbus-1.so: error adding symbols: file in wrong format
collect2: error: ld returned 1 exit status
ninja: build stopped: subcommand failed.
==> ERROR: A failure occurred in build().
    Aborting...
:: Unable to build lib32-gamemode - makepkg exited with code: 4
:: lib32-gamemode has NOT been upgraded!

toluschr commented on 2019-08-11 13:34

After installing lib32-dbus additionally, the library does compile, but still not work.

"(LD_PRELOAD=)libgamemodeauto.0" launches, but quits after ~5 seconds. "gamemoded -s" shows the status as active, then as inactive.

I don't know if this is an issue with the package, but the 64bit version works just fine.

cspack77 commented on 2019-07-21 19:21

Build fails without lib32-dbus

ysblokje commented on 2018-04-14 16:00

thanks Storenfried, added as build dependency. This is an upstream issue because I build without systemd (in theory at least)

Anonymous comment on 2018-04-13 20:37

Failed to compile without lib32-systemd