Package Details: ksmoothdock 6.1-1

Git Clone URL: https://aur.archlinux.org/ksmoothdock.git (read-only)
Package Base: ksmoothdock
Description: A cool desktop panel for KDE Plasma 5
Upstream URL: https://github.com/dangvd/ksmoothdock
Keywords: dock kde panel plasma qt5
Licenses: GPL3
Submitter: omni
Maintainer: omni
Last Packager: omni
Votes: 6
Popularity: 0.088127
First Submitted: 2017-05-18 17:56
Last Updated: 2019-11-25 07:54

Latest Comments

thiosin commented on 2019-11-22 19:31

Tried to build at latest commit (793b94e7559f93a22e17e9370e01108cc4ec8014), still same error: usr/include/c++/9.2.0/bits/fs_fwd.:39: Parse error at "std"

simona commented on 2019-11-10 12:05

usr/include/c++/9.2.0/bits/fs_fwd.:39: Parse error at "std"

kinoe commented on 2019-11-09 22:51

Build error: AutoMoc subprocess error

The moc process failed to compile "/home/kinoe/.cache/pikaur/build/ksmoothdock/src/ksmoothdock-6.0/src/utils/command_utils_test.cc"

into

"/home/kinoe/.cache/pikaur/build/ksmoothdock/src/ksmoothdock-6.0/command_utils_test_autogen/include/command_utils_test.moc" included by

"/home/kinoe/.cache/pikaur/build/ksmoothdock/src/ksmoothdock-6.0/src/utils/command_utils_test.cc"

Output

usr/include/c++/9.2.0/bits/fs_fwd.:39: Parse error at "std"

make[2]: *** [CMakeFiles/command_utils_test_autogen.dir/build.make:58: CMakeFiles/command_utils_test_autogen] Error 1

make[1]: *** [CMakeFiles/Makefile2:904: CMakeFiles/command_utils_test_autogen.dir/all] Error 2

make: *** [Makefile:141: all] Error 2