Package Details: khronos-ocl-icd-git 2020.12.18.7.g9b5e384-1

Git Clone URL: https://aur.archlinux.org/khronos-ocl-icd-git.git (read-only, click to copy)
Package Base: khronos-ocl-icd-git
Description: Khronos Group OpenCL 1.2 installable client driver (ICD) loader. (GIT Version)
Upstream URL: http://www.khronos.org/registry/cl
Licenses: Apache
Conflicts: libcl, ocl-icd, opencl-icd-loader
Provides: libcl, ocl-icd, opencl-icd-loader
Submitter: sl1pkn07
Maintainer: sl1pkn07
Last Packager: sl1pkn07
Votes: 0
Popularity: 0.000000
First Submitted: 2020-03-13 21:39
Last Updated: 2021-04-15 18:51

Required by (205)

Sources (2)

Latest Comments

andrfgs commented on 2021-04-15 16:26

Package is completely broken, as is the non git khrono-ocl-icd package.

Seems to be a link error:

/usr/bin/ld: CMakeFiles/icd_loader_test.dir/test_platforms.c.o:(.bss+0x110): multiple definition of `ret_val'; CMakeFiles/icd_loader_test.dir/test_kernel.c.o:(.bss+0x348): first defined here
/usr/bin/ld: CMakeFiles/icd_loader_test.dir/test_program_objects.c.o:(.bss+0x0): multiple definition of `ret_val'; CMakeFiles/icd_loader_test.dir/test_kernel.c.o:(.bss+0x348): first defined here
/usr/bin/ld: CMakeFiles/icd_loader_test.dir/test_sampler_objects.c.o:(.bss+0x0): multiple definition of `ret_val'; CMakeFiles/icd_loader_test.dir/test_kernel.c.o:(.bss+0x348): first defined here
/usr/bin/ld: CMakeFiles/icd_loader_test.dir/test_cl_runtime.c.o:(.bss+0x0): multiple definition of `ret_val'; CMakeFiles/icd_loader_test.dir/test_kernel.c.o:(.bss+0x348): first defined here
/usr/bin/ld: CMakeFiles/icd_loader_test.dir/test_clgl.c.o:(.bss+0x248): multiple definition of `ret_val'; CMakeFiles/icd_loader_test.dir/test_kernel.c.o:(.bss+0x348): first defined here
/usr/bin/ld: CMakeFiles/icd_loader_test.dir/test_image_objects.c.o:(.bss+0x0): multiple definition of `ret_val'; CMakeFiles/icd_loader_test.dir/test_kernel.c.o:(.bss+0x348): first defined here
collect2: error: ld returned 1 exit status
make[3]: *** [test/loader_test/CMakeFiles/icd_loader_test.dir/build.make:275: ../bin/icd_loader_test] Erro 1
make[3]: a sair da pasta "/home/user/.cache/yay/khronos-ocl-icd/src/icd/build"
make[2]: *** [CMakeFiles/Makefile2:230: test/loader_test/CMakeFiles/icd_loader_test.dir/all] Erro 2
make[2]: a sair da pasta "/home/user/.cache/yay/khronos-ocl-icd/src/icd/build"
make[1]: *** [Makefile:101: all] Erro 2
make[1]: a sair da pasta "/home/user/.cache/yay/khronos-ocl-icd/src/icd/build"
make: *** [Makefile:13: do_build] Erro 2

FabioLolix commented on 2020-12-09 17:07

Would be nice follow more packaging guidelines https://wiki.archlinux.org/index.php/VCS_package_guidelines#Git

sl1pkn07 commented on 2020-12-09 14:25

the problem is?

FabioLolix commented on 2020-12-09 08:08

Please remove the 'v' prefix from pkgver() in all of your pkgbuilds

FabioLolix commented on 2020-04-24 19:49

hello, the license is Apache (2.0)