Package Details: keeweb 1.8.2-1

Git Clone URL: https://aur.archlinux.org/keeweb.git (read-only)
Package Base: keeweb
Description: Desktop password manager compatible with KeePass databases
Upstream URL: https://keeweb.info
Keywords: kdbx keepass password
Licenses: MIT
Conflicts: keeweb-desktop
Submitter: surefire
Maintainer: surefire
Last Packager: surefire
Votes: 7
Popularity: 0.043906
First Submitted: 2016-09-26 07:43
Last Updated: 2019-04-22 13:59

Dependencies (7)

Required by (0)

Sources (4)

Latest Comments

« First ‹ Previous 1 2 3 Next › Last »

AlexWayfer commented on 2018-12-07 16:38

Sorry. After downgrading Electron to version 2 everything is OK. And after upgrading Electron to 3 I also can't reproduce (without KeeWeb upgrading). It's strange.

AlexWayfer commented on 2018-12-07 16:36

But for compatibility I will switch to electron2

Let me sure, that the reason in Electron 3. I'll downgrade an write here the result.

surefire commented on 2018-12-07 16:25

The second KeeWeb window appears after password entering

I can't reproduce.
But for compatibility I will switch to electron2

AlexWayfer commented on 2018-12-07 16:10

The second KeeWeb window appears after password entering. Electron was updated from version 2 to version 3.

surefire commented on 2018-11-06 16:57

@jonher937, Sorry, fixed.

In the last revisions, there is nothing critical, in addition to increasing the speed of build by use libsass.

I also adopted keeweb-git. Updated it to the latest version using develop branch.

jonher937 commented on 2018-11-06 16:29

Looks like the sha1sum of package.json.patch.js is invalid

➜ keeweb git:(master) sha1sum package.json.patch.js 3cad1556a5a855a3ab5152f1b2cb175287bd8368 package.json.patch.js

➜ keeweb git:(master) makepkg query makepkg -cf
==> Making package: keeweb 1.6.3-3 (Tue 06 Nov 2018 05:27:59 PM CET) ==> Checking runtime dependencies... ==> Checking buildtime dependencies... ==> Retrieving sources... -> Found v1.6.3.tar.gz -> Found keeweb -> Found package.json.patch.js ==> Validating source files with sha1sums... v1.6.3.tar.gz ... Passed keeweb ... Passed package.json.patch.js ... FAILED

➜ keeweb git:(master) curl https://aur.archlinux.org/cgit/aur.git/plain/package.json.patch.js\?h\=keeweb | sha1sum

3cad1556a5a855a3ab5152f1b2cb175287bd8368

surefire commented on 2018-10-14 10:47

@alfredo.ardito, fixed

alfredo.ardito commented on 2018-10-14 08:57

Faild building with yay.

make: *** [binding.target.mk:115: Release/obj.target/binding/src/binding.o] Error 1
make: Leaving directory '/home/username/.cache/yay/keeweb/src/keeweb-1.6.3/node_modules/node-sass/build'
gyp ERR! build error
gyp ERR! stack Error: make failed with exit code: 2
gyp ERR! stack at ChildProcess.onExit (/home/username/.cache/yay/keeweb/src/keeweb-1.6.3/node_modules/node-gyp/lib/build.js:258:23)
gyp ERR! stack at ChildProcess.emit (events.js:182:13)
gyp ERR! stack at Process.ChildProcess._handle.onexit (internal/child_process.js:240:12)
gyp ERR! System Linux 4.18.12-arch1-1-ARCH
gyp ERR! command "/usr/bin/node" "/home/username/.cache/yay/keeweb/src/keeweb-1.6.3/node_modules/node-gyp/bin/node-gyp.js" "rebuild" "--verbose" "--libsass_ext=" "--libsass_cflags=" "--libsass_ldflags=" "--libsass_library="
gyp ERR! cwd /home/username/.cache/yay/keeweb/src/keeweb-1.6.3/node_modules/node-sass
gyp ERR! node -v v10.11.0
gyp ERR! node-gyp -v v3.6.2
gyp ERR! not ok
Build failed with error code: 1
npm WARN optional SKIPPING OPTIONAL DEPENDENCY: keytar@4.0.3 (node_modules/keytar):
npm WARN optional SKIPPING OPTIONAL DEPENDENCY: keytar@4.0.3 install: node-gyp rebuild
npm WARN optional SKIPPING OPTIONAL DEPENDENCY: Exit status 1

npm ERR! code ELIFECYCLE
npm ERR! errno 1
npm ERR! node-sass@4.5.3 postinstall: node scripts/build.js
npm ERR! Exit status 1
npm ERR!
npm ERR! Failed at the node-sass@4.5.3 postinstall script.
npm ERR! This is probably not a problem with npm. There is likely additional logging output above.

npm ERR! A complete log of this run can be found in:
npm ERR! /home/username/.npm/_logs/2018-10-14T08_33_59_442Z-debug.log
==> ERROR: A failure occurred in build().
Aborting...
Error making: keeweb

AlexWayfer commented on 2017-12-11 20:30

@surefire, I had the same output, but still no available executable. Reinstalling (including uninstalling) of asar package helped.

surefire commented on 2017-12-08 07:03

$ pacman -Ql asar | grep /usr/bin
asar /usr/bin/
asar /usr/bin/asar