Package Details: kdevelop-python-git 5.6.2.r3.gf8b381b6-1

Git Clone URL: https://aur.archlinux.org/kdevelop-python-git.git (read-only, click to copy)
Package Base: kdevelop-python-git
Description: Python language and documentation plugin for KDevelop, git version
Upstream URL: http://www.kdevelop.org/
Licenses: GPL
Conflicts: kdevelop-python
Provides: kdevelop-python
Submitter: micwoj92
Maintainer: micwoj92 (scummos)
Last Packager: micwoj92
Votes: 6
Popularity: 0.000000
First Submitted: 2021-04-10 22:40
Last Updated: 2021-04-10 22:40

Dependencies (5)

Required by (0)

Sources (1)

Latest Comments

1 2 Next › Last »

micwoj92 commented on 2021-04-11 10:30

It has to be done by Trusted User, usually takes up to 2 weeks, I will add you to co maintainers of "kdevelop-python-git" package.

scummos commented on 2021-04-11 08:24

Sorry, I have no idea how to accept the merge with the kdevelop-python-git package ...

micwoj92 commented on 2021-03-28 13:57

Name should be kdevelop-python-git

tizbac commented on 2018-08-04 15:20

Add -DBUILD_TESTING=OFF to cmake command line to disable tests

Aetf commented on 2017-09-05 23:29

Is there a way to disable build testing targets, and thus not depending on KDev::Tests?

With recent changes in kdevelop, it seems KDev::Tests is no longer available if it's built with BUILD_TESTING=OFF.

Neros commented on 2016-08-02 22:10

@scummos Thank you! I think it works now :) I thought it was purely related with AUR but I didn't see you are also the maintainer here. So I will report to bugs.kde.org in the future.

scummos commented on 2016-08-02 13:10

Should work now, I forgot to merge the 5.0 branch.

Please report any crashes to bugs.kde.org. I am not aware of any crash bugs at the moment.

Neros commented on 2016-08-02 11:26

I can't compile anymore. And before I remove this package, it was a huge source of crashs with kdevelop. Are you in the same case?

```
[ 43%] Building CXX object debugger/CMakeFiles/kdevpdb.dir/debugjob.cpp.o
/tmp/yaourt-tmp-neros/aur-kdevelop-python3-git/src/kdev-python/duchain/helpers.cpp: Dans la fonction membre statique ‘static KDevelop::IndexedDeclaration Python::Helper::declarationUnderCursor(bool)’:
/tmp/yaourt-tmp-neros/aur-kdevelop-python3-git/src/kdev-python/duchain/helpers.cpp:106:49: erreur : could not convert ‘KDevelop::DUChainUtils::itemUnderCursor(KDevelop::IDocument::url(), cursor)’ from ‘KDevelop::DUChainUtils::ItemUnderCursor’ to ‘KDevelop::IndexedDeclaration’
return DUChainUtils::itemUnderCursor(doc->url(), cursor);
~~~~~~~~~~~~~~~~~~~~~~~~~~~~~^~~~~~~~~~~~~~~~~~~~
In file included from /tmp/yaourt-tmp-neros/aur-kdevelop-python3-git/src/kdev-python/duchain/pythonducontext.cpp:20:0:
/tmp/yaourt-tmp-neros/aur-kdevelop-python3-git/src/kdev-python/duchain/pythonducontext.h : dans l'instantiation de ‘class Python::PythonDUContext<KDevelop::TopDUContext, 100>’ :
/tmp/yaourt-tmp-neros/aur-kdevelop-python3-git/src/kdev-python/duchain/pythonducontext.cpp:41:28: required from here
/tmp/yaourt-tmp-neros/aur-kdevelop-python3-git/src/kdev-python/duchain/pythonducontext.h:62:22: attention : by ‘QWidget* Python::PythonDUContext<BaseContext, IdentityT>::createNavigationWidget(KDevelop::Declaration*, KDevelop::TopDUContext*, const QString&, const QString&) const [with BaseContext = KDevelop::TopDUContext; int IdentityT = 100]’ [-Woverloaded-virtual]
virtual QWidget* createNavigationWidget(KDevelop::Declaration* decl, KDevelop::TopDUContext* topContext,
^~~~~~~~~~~~~~~~~~~~~~
/tmp/yaourt-tmp-neros/aur-kdevelop-python3-git/src/kdev-python/duchain/pythonducontext.h : dans l'instantiation de ‘class Python::PythonDUContext<KDevelop::DUContext, 101>’ :
/tmp/yaourt-tmp-neros/aur-kdevelop-python3-git/src/kdev-python/duchain/pythonducontext.cpp:50:31: required from here
/tmp/yaourt-tmp-neros/aur-kdevelop-python3-git/src/kdev-python/duchain/pythonducontext.h:62:22: attention : by ‘QWidget* Python::PythonDUContext<BaseContext, IdentityT>::createNavigationWidget(KDevelop::Declaration*, KDevelop::TopDUContext*, const QString&, const QString&) const [with BaseContext = KDevelop::DUContext; int IdentityT = 101]’ [-Woverloaded-virtual]
make[2]: *** [duchain/CMakeFiles/kdevpythonduchain.dir/build.make:207: duchain/CMakeFiles/kdevpythonduchain.dir/helpers.cpp.o] Error 1
make[2]: *** Attente des tâches non terminées....
[ 44%] Building CXX object debugger/CMakeFiles/kdevpdb.dir/debugsession.cpp.o
[ 45%] Building CXX object debugger/CMakeFiles/kdevpdb.dir/pdbdebuggerplugin.cpp.o
[ 46%] Building CXX object debugger/CMakeFiles/kdevpdb.dir/debuggerdebug.cpp.o
[ 47%] Building CXX object debugger/CMakeFiles/kdevpdb.dir/kdevpdb_automoc.cpp.o
make[1]: *** [CMakeFiles/Makefile2:623: duchain/CMakeFiles/kdevpythonduchain.dir/all] Error 2
make[1]: *** Attente des tâches non terminées....
[ 48%] Linking CXX shared module kdevpdb.so
[ 48%] Built target kdevpdb
make: *** [Makefile:139: all] Error 2
==> ERREUR : Une erreur s’est produite dans build().
Abandon...
==> ERREUR : Makepkg n'a pas pu construire kdevelop-python3-git.
```

goetzc commented on 2016-07-02 20:11

It does work, thanks.

Oh, and I did confuse this package with kdevelop-git, for the kioclient problem.

scummos commented on 2016-07-02 18:19

Looks like it indeed, thanks for the hint. Try again now.