Package Details: kdelibs 4.14.38-4

Git Clone URL: https://aur.archlinux.org/kdelibs.git (read-only, click to copy)
Package Base: kdelibs
Description: KDE Core Libraries
Upstream URL: https://www.kde.org/
Licenses: GPL, LGPL, FDL
Submitter: arojas
Maintainer: None
Last Packager: arojas
Votes: 12
Popularity: 0.47
First Submitted: 2018-08-24 06:43
Last Updated: 2018-08-24 06:43

Sources (6)

Latest Comments

1 2 Next › Last »

Alkaris commented on 2020-12-23 11:23

This package is broken.

It wants to install, but then it says that it's unable to satisfy dependencies for the following;

Preparing...
Cloning kdelibs build files...
Checking kdelibs dependencies...
Failed to prepare transaction:
could not satisfy dependencies:
- unable to satisfy dependency 'attica-qt4' required by kdelibs
- unable to satisfy dependency 'libdbusmenu-qt4' required by kdelibs
- unable to satisfy dependency 'polkit-qt4' required by kdelibs
- unable to satisfy dependency 'phonon-qt4' required by kdelibs
- unable to satisfy dependency 'automoc4' required by kdelibs
Resolving dependencies...
Warning: cannot resolve "attica-qt4", a dependency of "kdelibs"
Warning: cannot resolve "libdbusmenu-qt4", a dependency of "kdelibs"
Warning: cannot resolve "polkit-qt4", a dependency of "kdelibs"
Warning: cannot resolve "phonon-qt4", a dependency of "kdelibs"
Warning: cannot resolve "automoc4", a dependency of "kdelibs"
Failed to prepare transaction:

All of these packages don't need to be looking for dependencies satisfied, because they're already currently installed on my system. If they already exist on the system, it should just install since all dependencies are satisfied.

piussj2 commented on 2020-12-22 15:36

I get:

/usr/include/qt4/QtCore/qmetatype.h:142:12: warning: implicitly-declared ‘QDBusObjectPath::QDBusObjectPath(const QDBusObjectPath&)’ is deprecated [-Wdeprecated-copy] 142 | return new T(static_cast<const T*>(t)); | ^~~~~~~~~~~~~~~~~~~~~~~~~~~~~~~~ In file included from /usr/include/qt4/QtDBus/qdbusabstractinterface.h:51, from /usr/include/qt4/QtDBus/QtDBus:5, from /mnt/hdb1/Doc/compile-2021/outros/kdelibs/src/build/kdeui/knotify_interface.h:21, from /mnt/hdb1/Doc/compile-2021/outros/kdelibs/src/build/kdeui/knotify_interface.cpp:12: /usr/include/qt4/QtDBus/qdbusextratypes.h:93:25: note: because ‘QDBusObjectPath’ has user-provided ‘QDBusObjectPath& QDBusObjectPath::operator=(const QDBusObjectPath&)’ 93 | inline QDBusObjectPath &QDBusObjectPath::operator=(const QDBusObjectPath &_path) | ^~~~~~~~~~~~~~~ In file included from /usr/include/qt4/QtCore/qvariant.h:48, from /usr/include/qt4/QtCore/QVariant:1, from /mnt/hdb1/Doc/compile-2021/outros/kdelibs/src/build/kdeui/knotify_interface.h:20, from /mnt/hdb1/Doc/compile-2021/outros/kdelibs/src/build/kdeui/knotify_interface.cpp:12: /usr/include/qt4/QtCore/qmetatype.h: In instantiation of ‘void qMetaTypeConstructHelper(const T) [with T = QDBusSignature]’: /usr/include/qt4/QtCore/qmetatype.h:196:18: required from ‘int qRegisterMetaType(const char, T) [with T = QDBusSignature]’ /usr/include/qt4/QtDBus/qdbusextratypes.h:187:1: required from here /usr/include/qt4/QtCore/qmetatype.h:142:12: warning: implicitly-declared ‘QDBusSignature::QDBusSignature(const QDBusSignature&)’ is deprecated [-Wdeprecated-copy] 142 | return new T(static_cast<const T*>(t)); | ^~~~~~~~~~~~~~~~~~~~~~~~~~~~~~~~ In file included from /usr/include/qt4/QtDBus/qdbusabstractinterface.h:51, from /usr/include/qt4/QtDBus/QtDBus:5, from /mnt/hdb1/Doc/compile-2021/outros/kdelibs/src/build/kdeui/knotify_interface.h:21, from /mnt/hdb1/Doc/compile-2021/outros/kdelibs/src/build/kdeui/knotify_interface.cpp:12: /usr/include/qt4/QtDBus/qdbusextratypes.h:143:24: note: because ‘QDBusSignature’ has user-provided ‘QDBusSignature& QDBusSignature::operator=(const QDBusSignature&)’ 143 | inline QDBusSignature &QDBusSignature::operator=(const QDBusSignature &dbusSignature) | ^~~~~~~~~~~~~~ In file included from /usr/include/qt4/QtCore/qobject.h:50, from /usr/include/qt4/QtCore/QObject:1, from /mnt/hdb1/Doc/compile-2021/outros/kdelibs/src/build/kdeui/knotify_interface.h:14, from /mnt/hdb1/Doc/compile-2021/outros/kdelibs/src/build/kdeui/knotify_interface.cpp:12: /usr/include/qt4/QtCore/qlist.h: In instantiation of ‘void QList<T>::node_copy(QList<T>::Node, QList<T>::Node, QList<T>::Node) [with T = QDBusObjectPath]’: /usr/include/qt4/QtCore/qlist.h:711:9: required from ‘void QList<T>::detach_helper(int) [with T = QDBusObjectPath]’ /usr/include/qt4/QtCore/qlist.h:725:18: required from ‘void QList<T>::detach_helper() [with T = QDBusObjectPath]’ /usr/include/qt4/QtCore/qlist.h:122:93: required from ‘QList<T>::QList(const QList<T>&) [with T = QDBusObjectPath]’ /usr/include/qt4/QtCore/qmetatype.h:142:12: required from ‘void qMetaTypeConstructHelper(const T) [with T = QList<QDBusObjectPath>]’ /usr/include/qt4/QtCore/qmetatype.h:196:18: required from ‘int qRegisterMetaType(const char, T) [with T = QList<QDBusObjectPath>]’ /usr/include/qt4/QtDBus/qdbusextratypes.h:186:1: required from here /usr/include/qt4/QtCore/qlist.h:399:30: warning: implicitly-declared ‘QDBusObjectPath::QDBusObjectPath(const QDBusObjectPath&)’ is deprecated [-Wdeprecated-copy] 399 | current->v = new T(reinterpret_cast<T*>(src->v)); | ^~~~~~~~~~~~~~~~~~~~~~~~~~~~~~~~~~~~ In file included from /usr/include/qt4/QtDBus/qdbusabstractinterface.h:51, from /usr/include/qt4/QtDBus/QtDBus:5, from /mnt/hdb1/Doc/compile-2021/outros/kdelibs/src/build/kdeui/knotify_interface.h:21, from /mnt/hdb1/Doc/compile-2021/outros/kdelibs/src/build/kdeui/knotify_interface.cpp:12: /usr/include/qt4/QtDBus/qdbusextratypes.h:93:25: note: because ‘QDBusObjectPath’ has user-provided ‘QDBusObjectPath& QDBusObjectPath::operator=(const QDBusObjectPath&)’ 93 | inline QDBusObjectPath &QDBusObjectPath::operator=(const QDBusObjectPath &_path) | ^~~~~~~~~~~~~~~ In file included from /usr/include/qt4/QtCore/qobject.h:50, from /usr/include/qt4/QtCore/QObject:1, from /mnt/hdb1/Doc/compile-2021/outros/kdelibs/src/build/kdeui/knotify_interface.h:14, from /mnt/hdb1/Doc/compile-2021/outros/kdelibs/src/build/kdeui/knotify_interface.cpp:12: /usr/include/qt4/QtCore/qlist.h:412:17: warning: implicitly-declared ‘QDBusObjectPath::QDBusObjectPath(const QDBusObjectPath&)’ is deprecated [-Wdeprecated-copy] 412 | new (current) T(reinterpret_cast<T*>(src)); | ^~~~~~~~~~~~~~~~~~~~~~~~~~~~~~~~~~~~~~~~~~~ In file included from /usr/include/qt4/QtDBus/qdbusabstractinterface.h:51, from /usr/include/qt4/QtDBus/QtDBus:5, from /mnt/hdb1/Doc/compile-2021/outros/kdelibs/src/build/kdeui/knotify_interface.h:21, from /mnt/hdb1/Doc/compile-2021/outros/kdelibs/src/build/kdeui/knotify_interface.cpp:12: /usr/include/qt4/QtDBus/qdbusextratypes.h:93:25: note: because ‘QDBusObjectPath’ has user-provided ‘QDBusObjectPath& QDBusObjectPath::operator=(const QDBusObjectPath&)’ 93 | inline QDBusObjectPath &QDBusObjectPath::operator=(const QDBusObjectPath &_path) | ^~~~~~~~~~~~~~~ In file included from /usr/include/qt4/QtCore/qobject.h:50, from /usr/include/qt4/QtCore/QObject:1, from /mnt/hdb1/Doc/compile-2021/outros/kdelibs/src/build/kdeui/knotify_interface.h:14, from /mnt/hdb1/Doc/compile-2021/outros/kdelibs/src/build/kdeui/knotify_interface.cpp:12: /usr/include/qt4/QtCore/qlist.h: In instantiation of ‘void QList<T>::node_copy(QList<T>::Node, QList<T>::Node, QList<T>::Node) [with T = QDBusSignature]’: /usr/include/qt4/QtCore/qlist.h:711:9: required from ‘void QList<T>::detach_helper(int) [with T = QDBusSignature]’ /usr/include/qt4/QtCore/qlist.h:725:18: required from ‘void QList<T>::detach_helper() [with T = QDBusSignature]’ /usr/include/qt4/QtCore/qlist.h:122:93: required from ‘QList<T>::QList(const QList<T>&) [with T = QDBusSignature]’ /usr/include/qt4/QtCore/qmetatype.h:142:12: required from ‘void qMetaTypeConstructHelper(const T) [with T = QList<QDBusSignature>]’ /usr/include/qt4/QtCore/qmetatype.h:196:18: required from ‘int qRegisterMetaType(const char, T) [with T = QList<QDBusSignature>]’ /usr/include/qt4/QtDBus/qdbusextratypes.h:188:1: required from here /usr/include/qt4/QtCore/qlist.h:399:30: warning: implicitly-declared ‘QDBusSignature::QDBusSignature(const QDBusSignature&)’ is deprecated [-Wdeprecated-copy] 399 | current->v = new T(reinterpret_cast<T*>(src->v)); | ^~~~~~~~~~~~~~~~~~~~~~~~~~~~~~~~~~~~ In file included from /usr/include/qt4/QtDBus/qdbusabstractinterface.h:51, from /usr/include/qt4/QtDBus/QtDBus:5, from /mnt/hdb1/Doc/compile-2021/outros/kdelibs/src/build/kdeui/knotify_interface.h:21, from /mnt/hdb1/Doc/compile-2021/outros/kdelibs/src/build/kdeui/knotify_interface.cpp:12: /usr/include/qt4/QtDBus/qdbusextratypes.h:143:24: note: because ‘QDBusSignature’ has user-provided ‘QDBusSignature& QDBusSignature::operator=(const QDBusSignature&)’ 143 | inline QDBusSignature &QDBusSignature::operator=(const QDBusSignature &dbusSignature) | ^~~~~~~~~~~~~~ In file included from /usr/include/qt4/QtCore/qobject.h:50, from /usr/include/qt4/QtCore/QObject:1, from /mnt/hdb1/Doc/compile-2021/outros/kdelibs/src/build/kdeui/knotify_interface.h:14, from /mnt/hdb1/Doc/compile-2021/outros/kdelibs/src/build/kdeui/knotify_interface.cpp:12: /usr/include/qt4/QtCore/qlist.h:412:17: warning: implicitly-declared ‘QDBusSignature::QDBusSignature(const QDBusSignature&)’ is deprecated [-Wdeprecated-copy] 412 | new (current) T(reinterpret_cast<T*>(src)); | ^~~~~~~~~~~~~~~~~~~~~~~~~~~~~~~~~~~~~~~~~~~ In file included from /usr/include/qt4/QtDBus/qdbusabstractinterface.h:51, from /usr/include/qt4/QtDBus/QtDBus:5, from /mnt/hdb1/Doc/compile-2021/outros/kdelibs/src/build/kdeui/knotify_interface.h:21, from /mnt/hdb1/Doc/compile-2021/outros/kdelibs/src/build/kdeui/knotify_interface.cpp:12: /usr/include/qt4/QtDBus/qdbusextratypes.h:143:24: note: because ‘QDBusSignature’ has user-provided ‘QDBusSignature& QDBusSignature::operator=(const QDBusSignature&)’ 143 | inline QDBusSignature &QDBusSignature::operator=(const QDBusSignature &dbusSignature) | ^~~~~~~~~~~~~~ [ 41%] Linking CXX shared library ../lib/libkdeui.so [ 41%] Built target kdeui make: *** [Makefile:182: all] Erro 2 ==> ERRO: Uma falha ocorreu em build(). Abortando... [piu@sayumin kdelibs]$

abd commented on 2020-07-06 13:05

How to solve

-- Build files have been written to: /kdelibs/src/build
Unable to load library icui18n "Cannot load library icui18n: (icui18n: cannot open shared object file: No such file or directory)"
Unable to load library icui18n "Cannot load library icui18n: (icui18n: cannot open shared object file: No such file or directory)"
[ 0%] Built target kdefakes
Generating moc_DBusHelperProxy.cpp
Unable to load library icui18n "Cannot load library icui18n: (icui18n: cannot open shared object file: No such file or directory)"

StuckUpCreations commented on 2020-06-19 08:59

kdelibs/src/kdelibs-4.14.38/dnssd/servicemodel.cpp:90:7: error: narrowing conversion of ‘DNSSD::ServiceModel::ServicePtrRole’ from ‘unsigned int’ to ‘int’ [-Wnarrowing] 90 | case ServicePtrRole: QVariant ret;

realasking commented on 2020-04-02 03:47

This package cannot be compiled properly any more. Needs to be renewed:

[  0%] Built target ktranscript_automoc
/tmp/yaourt-tmp-realasking/aur-kdelibs/src/kdelibs-4.14.38/kdecore/auth/backends/dbus/DBusHelperProxy.h:35: Error: Undefined interface
automoc4: process for /tmp/yaourt-tmp-realasking/aur-kdelibs/src/build/kdecore/moc_DBusHelperProxy.cpp failed: Unknown error
pid to wait for: 0
returning failed..
make[2]: *** [kdecore/CMakeFiles/kauth_helper_plugin_automoc.dir/build.make:74:kdecore/CMakeFiles/kauth_helper_plugin_automoc] 错误 1
make[2]: 离开目录“/tmp/yaourt-tmp-realasking/aur-kdelibs/src/build”
make[1]: *** [CMakeFiles/Makefile2:5094:kdecore/CMakeFiles/kauth_helper_plugin_automoc.dir/all] 错误 2
Scanning dependencies of target kconfig_compiler_automoc
make[2]: 离开目录“/tmp/yaourt-tmp-realasking/aur-kdelibs/src/build”
make[2]: 进入目录“/tmp/yaourt-tmp-realasking/aur-kdelibs/src/build”
Unable to load library icui18n "Cannot load library icui18n: (icui18n: 无法打开共享对象文件: 没有那个文件或目录)" 
[  0%] Linking C shared library ../lib/libkdefakes.so
make[2]: 离开目录“/tmp/yaourt-tmp-realasking/aur-kdelibs/src/build”
[  0%] Built target kconfig_compiler_automoc
make[2]: 离开目录“/tmp/yaourt-tmp-realasking/aur-kdelibs/src/build”
[  0%] Built target kdefakes
make[1]: 离开目录“/tmp/yaourt-tmp-realasking/aur-kdelibs/src/build”
make: *** [Makefile:180:all] 错误 2

JohnRobson commented on 2019-10-28 01:43

Generating moc_dynamictreemodel.cpp
Generating kssld.moc
[  0%] Built target kcolorutilsdemo_automoc
[  0%] Built target kdeui_automoc
[  0%] Built target proxymodeltestsuite_automoc
[  0%] Built target kded_kssld_automoc
[  0%] Built target kdefakes
make: *** [Makefile:163: all] Error 2
==> ERROR: A failure occurred in build().
Aborting...
Error making: kdelibs

markboston35 commented on 2019-07-22 05:17

this package needs to be updated. its out of date.

dlwilson88 commented on 2019-07-19 06:23

I am getting multiple errors trying to build this package.

[ 0%] Building CXX object kdecore/CMakeFiles/kdecore.dir/config/kconfigbackend.cpp.o /home/dlw88/.cache/yay/kdelibs/src/kdelibs-4.14.38/kdecore/config/kconfigbackend.cpp:42:10: fatal error: kconfigbackend.moc: No such file or directory 42 | #include "kconfigbackend.moc" | ^~~~~~~~~~~~~~~~~~~~ compilation terminated. make[2]: [kdecore/CMakeFiles/kdecore.dir/build.make:167: kdecore/CMakeFiles/kdecore.dir/config/kconfigbackend.cpp.o] Error 1 make[1]: [CMakeFiles/Makefile2:1154: kdecore/CMakeFiles/kdecore.dir/all] Error 2 make: *** [Makefile:163: all] Error 2 ==> ERROR: A failure occurred in build(). Aborting... Error making: kdelibs

linuxyz commented on 2019-07-09 20:44

it's not building correctly:

/home/linuxyz/.cache/pikaur/build/kdelibs/src/kdelibs-4.14.38/kdecore/config/kconfigbackend.cpp:42:10: fatal error: kconfigbackend.moc: No such file or directory 42 | #include "kconfigbackend.moc" | ^~~~~~~~~~~~~~~~~~~~ compilation terminated. make[2]: [kdecore/CMakeFiles/kdecore.dir/build.make:167: kdecore/CMakeFiles/kdecore.dir/config/kconfigbackend.cpp.o] Error 1 make[1]: [CMakeFiles/Makefile2:1154: kdecore/CMakeFiles/kdecore.dir/all] Error 2 make: *** [Makefile:163: all] Error 2 ==> ERROR: A failure occurred in build(). Aborting...

bidulock commented on 2018-12-22 08:18

Thank you again for the PKGBUILD: it still builds fine in a clean chroot on both x86_64 and i686 architectures.