Package Details: julia-git 1.7.0.DEV.r48888.g7b19e097294-1

Git Clone URL: (read-only, click to copy)
Package Base: julia-git
Description: High-level, high-performance, dynamic programming language
Upstream URL:
Licenses: MIT
Conflicts: julia
Provides: julia
Submitter: mihi
Maintainer: TrialnError (fusion809, mar)
Last Packager: mar
Votes: 53
Popularity: 0.25
First Submitted: 2012-02-22 08:57
Last Updated: 2021-02-07 05:44

Required by (17)

Sources (3)

Latest Comments

1 2 3 4 5 6 ... Next › Last »

sh4kesbeer commented on 2020-12-31 09:04

There seems to be a dependency on 7z, as the build is failing with following error for me:

caused by: 7z binary not found

Volker_Weissmann commented on 2020-12-25 21:15

Without the patch below, build+installation fails on my machine because the stringreplace binary was not found.

diff --git a/PKGBUILD b/PKGBUILD
index 87ecf86..b56957a 100644
@@ -26,7 +26,7 @@ sha256sums=('SKIP'
-            '0b57e0bc6e25c92fde8a6474394f7a99bfb57f9b5d0f7b53f988622ae67de8b7')
+            '09b6077149fa3d22b71b63e471f077d1f3dbeb39d682030c73c316e939e2cc19')

 pkgver() {
diff --git a/make-install-no-build.patch b/make-install-no-build.patch
index 6d89d95..19eeb43 100644
--- a/make-install-no-build.patch
+++ b/make-install-no-build.patch
@@ -10,7 +10,7 @@
 -  @$(MAKE) $(QUIET_MAKE) release
++install: $(build_depsbindir)/stringreplace
    @for subdir in $(bindir) $(datarootdir)/julia/stdlib/$(VERSDIR) $(docdir) $(man1dir) $(includedir)/julia $(libdir) $(private_libdir) $(sysconfdir) $(libexecdir); do \
        mkdir -p $(DESTDIR)$$subdir; \

PedroHLC commented on 2020-10-22 13:42

Building form a clean chroot, it failed with:

make[1]: Entering directory '/home/main-builder/pkgwork/src/julia'
 cd /home/main-builder/pkgwork/src/julia/base && /home/main-builder/pkgwork/src/julia/usr/bin/julia -C "native" --output-ji /home/main-builder/pkgwork/src/julia/usr/lib/julia/corecompiler.ji.tmp --startup-file=no --warn-overwrite=yes -g0 -O0 compiler/compiler.jl
ERROR: Unable to load dependent library /home/main-builder/pkgwork/src/julia/usr/bin/../lib/
Message:/home/main-builder/pkgwork/src/julia/usr/bin/../lib/ cannot open shared object file: No such file or directory
make[1]: *** [ /home/main-builder/pkgwork/src/julia/usr/lib/julia/corecompiler.ji] Error 1
make[1]: Leaving directory '/home/main-builder/pkgwork/src/julia'
make: *** [Makefile:81: julia-sysimg-ji] Error 2
make: Leaving directory '/home/main-builder/pkgwork/src/julia'
==> ERROR: A failure occurred in build().

TrialnError commented on 2020-06-22 19:39

@fusion809: Every little thing helps. Thank you for your offer :) I will add you as a co-maintainer.

fusion809 commented on 2020-06-21 14:27

@TrialInError I'd be happy to be a co-maintainer. Although, I will admit, I too have my limits in what I can fix. But I can at least fix the odd little things I know how to fix.

fusion809 commented on 2020-06-21 14:25

Build currently fails as docs aren't built but package_julia-git-docs() tries to install them anyway. To fix this, replace lines 68 to 70 of the PKGBUILD with: make.

dlin commented on 2020-03-20 02:02

Could you change to source from git to https to let firewall happier? That's


TrialnError commented on 2019-05-22 22:01

Since a while I haven't done anything with Julia. And since this time the updates and adjustment on this PKGBUILD got sparse. Patches for example couldn't be applied anymore. So anyone who wants to be added as a Comaintainer or even maintain it fully?

fusion809 commented on 2018-12-19 17:00

Build failed for me, with the error:

CC src/flisp/julia_extensions.o
LINK src/flisp/libflisp.a
CC src/flisp/flmain.o
LINK src/flisp/flisp

make[2]: Leaving directory '/data/AUR/julia-git/src/julia/src/flisp' FLISP src/julia_flisp.boot FLISP src/ make[1]: Leaving directory '/data/AUR/julia-git/src/julia/src' make[1]: Entering directory '/data/AUR/julia-git/src/julia/src' CC src/jltypes.o In file included from /usr/include/libunwind-x86_64.h:129, from /usr/include/libunwind.h:25, from /data/AUR/julia-git/src/julia/src/julia_internal.h:619, from /data/AUR/julia-git/src/julia/src/jltypes.c:14: /data/AUR/julia-git/src/julia/src/julia_internal.h:623:35: error: floating constant in preprocessor expression (UNW_VERSION_MAJOR == 1 && UNW_VERSION_MINOR != 0 && UNW_VERSION_MINOR != 1)) ^~~~~~~~~~~~~~~~~ /data/AUR/julia-git/src/julia/src/julia_internal.h:623:61: error: floating constant in preprocessor expression (UNW_VERSION_MAJOR == 1 && UNW_VERSION_MINOR != 0 && UNW_VERSION_MINOR != 1)) ^~~~~~~~~~~~~~~~~ make[1]: [Makefile:131: jltypes.o] Error 1 make[1]: Leaving directory '/data/AUR/julia-git/src/julia/src' make: [Makefile:72: julia-src-release] Error 2 make: Leaving directory '/data/AUR/julia-git/src/julia' ==> ERROR: A failure occurred in build(). Aborting...

TrialnError commented on 2018-08-17 00:00

Did not forget about updating the PKGBUILD. But there are currently issues with some components, which causes failure in the build process. Need to identify those. And not really able to use system llvm isn't helping in the process