Package Details: jplag r46.23f14a4-1

Git Clone URL: https://aur.archlinux.org/jplag.git (read-only)
Package Base: jplag
Description: JPlag - Detecting Software Plagiarism
Upstream URL: http://www.jplag.de
Licenses: GPL3
Submitter: wil93
Maintainer: wil93
Last Packager: wil93
Votes: 0
Popularity: 0.000000
First Submitted: 2015-12-24 12:38
Last Updated: 2015-12-24 14:03

Latest Comments

cadilhac commented on 2019-10-18 18:42

Fails compiling with:

[INFO] ------------------------------------------------------------------------
[INFO] BUILD FAILURE
[INFO] ------------------------------------------------------------------------
[INFO] Total time:  25.571 s
[INFO] Finished at: 2019-10-18T13:40:38-05:00
[INFO] ------------------------------------------------------------------------
[ERROR] Failed to execute goal on project jplag: Could not resolve dependencies for project edu.kit.ipd.jplag:jplag:jar:2.12.1-SNAPSHOT: The following artifacts could not be resolved: edu.kit.ipd.jplag:frontend-utils:jar:0.0.3-SNAPSHOT, edu.kit.ipd.jplag:java-1.1exp:jar:0.0.1-SNAPSHOT, edu.kit.ipd.jplag:utils:jar:0.0.3-SNAPSHOT, edu.kit.ipd.jplag:text:jar:0.0.1-SNAPSHOT, edu.kit.ipd.jplag:java-1.5:jar:0.0.1-SNAPSHOT, edu.kit.ipd.jplag:java-1.7:jar:0.0.1-SNAPSHOT, edu.kit.ipd.jplag:java-1.9:jar:0.0.1-SNAPSHOT, edu.kit.ipd.jplag:python-3:jar:0.0.1-SNAPSHOT, edu.kit.ipd.jplag:csharp-1.2:jar:0.0.1-SNAPSHOT, edu.kit.ipd.jplag:cpp:jar:0.0.2-SNAPSHOT, edu.kit.ipd.jplag:scheme:jar:0.0.1-SNAPSHOT, edu.kit.ipd.jplag:chars:jar:0.0.1-SNAPSHOT: Could not find artifact edu.kit.ipd.jplag:frontend-utils:jar:0.0.3-SNAPSHOT in ipdNexus (http://bob.ipd.kit.edu/nexus/repository/maven-public-all) -> [Help 1]
[ERROR] 
[ERROR] To see the full stack trace of the errors, re-run Maven with the -e switch.
[ERROR] Re-run Maven using the -X switch to enable full debug logging.
[ERROR] 
[ERROR] For more information about the errors and possible solutions, please read the following articles:
[ERROR] [Help 1] http://cwiki.apache.org/confluence/display/MAVEN/DependencyResolutionException