Package Details: ipe 7.2.20-2

Git Clone URL: https://aur.archlinux.org/ipe.git (read-only, click to copy)
Package Base: ipe
Description: The extensible drawing editor
Upstream URL: http://ipe.otfried.org/
Licenses: GPL
Conflicts: ipe
Submitter: foxcub
Maintainer: foxcub
Last Packager: foxcub
Votes: 76
Popularity: 0.190992
First Submitted: 2007-01-02 01:58
Last Updated: 2020-06-27 16:58

Latest Comments

« First ‹ Previous ... 3 4 5 6 7 8 9 10 11 12 13 Next › Last »

noplomplom commented on 2012-12-15 08:57

Please update PKGBUILD with the correct md5sum for ipe-7.1.0.tar.gz: replace '25e7051ceb1286ccc7adf019793338b9' (5th line in the md5sums) with 'a0385f1a27aa8ed2730bd407d4680843'

tuomo commented on 2012-12-14 19:08

The MD5 sum seems to be wrong:

==> Validating source files with md5sums...
...
ipe-7.1.0.tar.gz ... FAILED

RobLikesBrunch commented on 2012-12-14 17:48

I get the same thing as Liquen:

Compiling ipelib.cpp...
g++ -march=x86-64 -mtune=generic -O2 -pipe -fstack-protector --param=ssp-buffer-size=4 -D_FORTIFY_SOURCE=2 -Wall -g -O2 -fpic -DIPEUI_QT -I../include -c -o ../../build/obj/ipelua/ipelib.o ipelib.cpp
ipelib.cpp: In function ‘void ipelua::make_metatable(lua_State*, const char*, const luaL_Reg*)’:
ipelib.cpp:51:30: error: ‘luaL_register’ was not declared in this scope
ipelib.cpp: In function ‘int ipe_splinetobeziers(lua_State*)’:
ipelib.cpp:539:27: error: ‘lua_objlen’ was not declared in this scope
ipelib.cpp: In function ‘int luaopen_ipe(lua_State*)’:
ipelib.cpp:620:39: error: ‘luaL_register’ was not declared in this scope
make[1]: *** [../../build/obj/ipelua/ipelib.o] Error 1
make[1]: Leaving directory `/tmp/yaourt-tmp-robert/aur-ipe/src/ipe-7.1.2/src/ipelua'
make: *** [ipelua] Error 2


And I have lua51 installed. Any ideas?

foxcub commented on 2012-12-14 17:07

Try it now.

foxcub commented on 2012-12-14 17:00

I see this problem, too, when building. It's easy to fix, but then there is another problem with poppler that I don't know how to fix. I won't update the package until I figure it out.

RobLikesBrunch commented on 2012-12-14 16:36

I get the same thing as Liquen:

Compiling ipelib.cpp...
g++ -march=x86-64 -mtune=generic -O2 -pipe -fstack-protector --param=ssp-buffer-size=4 -D_FORTIFY_SOURCE=2 -Wall -g -O2 -fpic -DIPEUI_QT -I../include -c -o ../../build/obj/ipelua/ipelib.o ipelib.cpp
ipelib.cpp: In function ‘void ipelua::make_metatable(lua_State*, const char*, const luaL_Reg*)’:
ipelib.cpp:51:30: error: ‘luaL_register’ was not declared in this scope
ipelib.cpp: In function ‘int ipe_splinetobeziers(lua_State*)’:
ipelib.cpp:539:27: error: ‘lua_objlen’ was not declared in this scope
ipelib.cpp: In function ‘int luaopen_ipe(lua_State*)’:
ipelib.cpp:620:39: error: ‘luaL_register’ was not declared in this scope
make[1]: *** [../../build/obj/ipelua/ipelib.o] Error 1
make[1]: Leaving directory `/tmp/yaourt-tmp-robert/aur-ipe/src/ipe-7.1.2/src/ipelua'
make: *** [ipelua] Error 2


And I have lua51 installed. Any ideas?

foxcub commented on 2012-12-13 17:45

Ok, an easy workaround is to install lua51. I'll add it to the dependencies.

foxcub commented on 2012-12-13 17:44

Actually, there seems to be some weirdness with the new Lua package. Let me check with the Arch package maintainer.

foxcub commented on 2012-12-13 17:42

That's an upstream problem. Can you report it on Ipe's bugtracker?

Liquen commented on 2012-12-12 18:03

Thank you for your response! I get this when rebuilding:

Compiling ipelib.cpp...
g++ -march=x86-64 -mtune=generic -O2 -pipe -fstack-protector --param=ssp-buffer-size=4 -D_FORTIFY_SOURCE=2 -Wall -g -O2 -fpic -DIPEUI_QT -I../include -c -o ../../build/obj/ipelua/ipelib.o ipelib.cpp
ipelib.cpp: In function ‘void ipelua::make_metatable(lua_State*, const char*, const luaL_Reg*)’:
ipelib.cpp:51:30: error: ‘luaL_register’ was not declared in this scope
ipelib.cpp: In function ‘int ipe_splinetobeziers(lua_State*)’:
ipelib.cpp:539:27: error: ‘lua_objlen’ was not declared in this scope
ipelib.cpp: In function ‘int luaopen_ipe(lua_State*)’:
ipelib.cpp:620:39: error: ‘luaL_register’ was not declared in this scope
make[1]: *** [../../build/obj/ipelua/ipelib.o] Error 1
make[1]: Leaving directory `/home/*******/ipe/src/ipe-7.1.2/src/ipelua'
make: *** [ipelua] Error 2
==> ERROR: A failure occurred in build().
Aborting...