Package Details: ip-sentinel 0.12-4

Git Clone URL: https://aur.archlinux.org/ip-sentinel.git (read-only, click to copy)
Package Base: ip-sentinel
Description: prevent usage of IPs by giving answers to ARP-requests
Upstream URL: http://www.nongnu.org/ip-sentinel/
Licenses: GPL
Submitter: mortzu
Maintainer: severach
Last Packager: mortzu
Votes: 1
Popularity: 0.000000
First Submitted: 2009-04-25 11:09
Last Updated: 2015-06-08 09:41

Latest Comments

micwoj92 commented on 2020-08-23 03:17

Making all in src In file included from ../config.h:68, from ip-sentinel.c:20: ./compat.h:49:12: fatal error: stropts.h: No such file or directory 49 | # include <stropts.h> | ^~~~~~~~~~~ compilation terminated. In file included from ../config.h:68, from arguments.c:20: ./compat.h:49:12: fatal error: stropts.h: No such file or directory 49 | # include <stropts.h> | ^~~~~~~~~~~ compilation terminated. In file included from ../config.h:68, from blacklist.c:20: ./compat.h:49:12: fatal error: stropts.h: No such file or directory 49 | # include <stropts.h> | ^~~~~~~~~~~ compilation terminated. In file included from ../config.h:68, from util.c:20: ./compat.h:49:12: fatal error: stropts.h: No such file or directory 49 | # include <stropts.h> | ^~~~~~~~~~~ compilation terminated. make[3]: [Makefile:987: arguments.o] Error 1 make[3]: Waiting for unfinished jobs.... make[3]: [Makefile:987: ip-sentinel.o] Error 1 make[3]: [Makefile:987: blacklist.o] Error 1 make[3]: [Makefile:987: util.o] Error 1 make[2]: [Makefile:372: all-recursive] Error 1 make[1]: [Makefile:263: all] Error 2 make: [Makefile:782: .X_home_micwoj92_.cache_pikaur_build_ip-sentinel_pkg_ip-sentinel_usr_etc-up-to-date] Error 2 ==> ERROR: A failure occurred in build(). Aborting...