Package Details: iio-sensor-proxy-git 3.0.r18.4d5df70-1

Git Clone URL: https://aur.archlinux.org/iio-sensor-proxy-git.git (read-only, click to copy)
Package Base: iio-sensor-proxy-git
Description: IIO accelerometer sensor to input device proxy
Upstream URL: https://github.com/hadess/iio-sensor-proxy
Licenses: GPL2
Conflicts: iio-sensor-proxy
Provides: iio-sensor-proxy
Submitter: ultraviolet
Maintainer: robertfoster
Last Packager: robertfoster
Votes: 4
Popularity: 0.000000
First Submitted: 2015-07-05 21:46
Last Updated: 2020-07-17 16:56

Required by (7)

Sources (1)

Latest Comments

1 2 Next › Last »

freeeeeeeeeeee commented on 2020-07-15 22:59

Simply change the line arch-meson $_pkgname --reconfigure to arch-meson build $_pkgname

oddy commented on 2020-07-14 05:16

Directory does not contain a valid build tree

  • exec meson setup --prefix /usr --libexecdir lib --sbindir bin --buildtype plain --auto-features enabled --wrap-mode nodownload -D b_lto=true -D b_pie=true iio-sensor-proxy --reconfigure Directory does not contain a valid build tree: /home/dweller/.cache/yay/iio-sensor-proxy-git/src ==> ERROR: A failure occurred in build(). Aborting... Error making: iio-sensor-proxy-git

lviggiani commented on 2020-07-08 06:37

Hi, I'm getting the following error during build (using yay):

error making: %!s(func() string=0x5587f96bae80)

tasso commented on 2020-07-07 21:02

+1 - "Directory does not contain a valid build tree: [...]"

Sherlock commented on 2020-07-07 12:20

I am getting the same build error as Dani9oo

Dani9oo commented on 2020-07-02 23:43

Build failing right now

==> Starting build()... /home/user/.cache/yay/iio-sensor-proxy-git/PKGBUILD: line 25: ./autogen.sh: No such file or directory ==> ERROR: A failure occurred in build().

freeeeeeeeeeee commented on 2020-01-25 23:39

Upstream has changed to https://gitlab.freedesktop.org/hadess/iio-sensor-proxy/

parkerlreed commented on 2017-09-12 19:46

:: no results found for libgudev>=232 (dependency tree: iio-sensor-proxy-git libgudev)

EDIT: Oh the current package is out of date. At 231

aradan_d commented on 2017-04-17 14:41

I could install the package by doing `export WARN_CFLAGS="-Wno-unused-result -Wno-error=unused-result"` https://github.com/hadess/iio-sensor-proxy/issues/113

jwynn6 commented on 2017-04-11 15:23

The build is now failing for me.


CC fake_input_accelerometer-fake-input-accelerometer.o
fake-input-accelerometer.c: In function ‘send_uinput_event’:
fake-input-accelerometer.c:90:2: error: ignoring return value of ‘write’, declared with attribute warn_unused_result [-Werror=unused-result]
write (data->uinput, &ev, sizeof(ev));
^~~~~~~~~~~~~~~~~~~~~~~~~~~~~~~~~~~~~
fake-input-accelerometer.c:94:2: error: ignoring return value of ‘write’, declared with attribute warn_unused_result [-Werror=unused-result]
write (data->uinput, &ev, sizeof(ev));
^~~~~~~~~~~~~~~~~~~~~~~~~~~~~~~~~~~~~
fake-input-accelerometer.c:98:2: error: ignoring return value of ‘write’, declared with attribute warn_unused_result [-Werror=unused-result]
write (data->uinput, &ev, sizeof(ev));
^~~~~~~~~~~~~~~~~~~~~~~~~~~~~~~~~~~~~
fake-input-accelerometer.c:104:2: error: ignoring return value of ‘write’, declared with attribute warn_unused_result [-Werror=unused-result]
write (data->uinput, &ev, sizeof(ev));
^~~~~~~~~~~~~~~~~~~~~~~~~~~~~~~~~~~~~
cc1: all warnings being treated as errors
make[2]: *** [Makefile:624: fake_input_accelerometer-fake-input-accelerometer.o] Error 1
make[2]: Leaving directory '/home/justin/iio-sensor-proxy-git/src/iio-sensor-proxy/src'
make[1]: *** [Makefile:434: all] Error 2
make[1]: Leaving directory '/home/justin/iio-sensor-proxy-git/src/iio-sensor-proxy/src'
make: *** [Makefile:385: all-recursive] Error 1
==> ERROR: A failure occurred in build().
Aborting...