Package Details: ignition-cmake 2.1.1-2

Git Clone URL: (read-only, click to copy)
Package Base: ignition-cmake
Description: Provides modules that are used to find dependencies of ignition projects and generate cmake targets for consumers of ignition projects to link against.
Upstream URL:
Licenses: Apache
Groups: development
Submitter: racko
Maintainer: acxz
Last Packager: acxz
Votes: 1
Popularity: 0.002382
First Submitted: 2018-02-24 09:35
Last Updated: 2020-03-06 16:01

Pinned Comments

acxz commented on 2020-02-03 02:15

Development is on Github: Please open issues and PRs there instead of commenting.

Latest Comments

« First ‹ Previous 1 2 3 Next › Last »

tomcattiger commented on 2019-08-07 14:13

@joaocandre if you'd met this problem because of installing of ROS, you can choose ignition-xxx-1 (usually the second choice).

acxz commented on 2019-07-21 18:23

@joaocandre I am afraid I do not know the solution to your issue. Can I ask why you want to use ignition-cmake? If it is for gazebo, ignition-cmake-0 is needed rather than the latest ignition-cmake.

joaocandre commented on 2019-07-21 17:50

@acxz done that (, but hasn't helped much though. Is this seriously only happening with me? I don't think there is anything wrong with python configuration at least, can't understand what's happening.

acxz commented on 2019-07-06 00:36

hmm @joaocandre that is weird, the build works fine on my machine. I suggest you create an upstream issue at

joaocandre commented on 2019-07-05 20:00

Compilation failing with

[ 15%] Performing codecheck step for 'core_no_deps_Debug'
Scanning dependencies of target codecheck
make[6]: *** [CMakeFiles/codecheck.dir/build.make:59: CMakeFiles/codecheck] Error 1
make[5]: *** [CMakeFiles/Makefile2:142: CMakeFiles/codecheck.dir/all] Error 2
make[4]: *** [CMakeFiles/Makefile2:149: CMakeFiles/codecheck.dir/rule] Error 2
make[3]: *** [Makefile:201: codecheck] Error 2
make[2]: *** [examples/CMakeFiles/core_no_deps_Debug.dir/build.make:124: examples/core_no_deps_Debug-prefix/src/core_no_deps_Debug-stamp/core_no_deps_Debug-codecheck] Error 2
make[1]: *** [CMakeFiles/Makefile2:1232: examples/CMakeFiles/core_no_deps_Debug.dir/all] Error 2
make: *** [Makefile:141: all] Error 2
==> ERROR: A failure occurred in build().

acxz commented on 2019-06-30 21:22

Ah pardon my ignorance, thank you for enlightening me!

EDIT: Fixed!

portaloffreedom commented on 2019-06-30 20:57

Could you please remove the -j4 option in make for all ignition packages? It overrides the default in my machine, where I have 8 cores... Users can achieve parallel compilation by editing the /etc/makepkg.conf and setting the MAKEFLAGS variable accordingly

Thanks :)

acxz commented on 2019-06-27 23:08


acxz commented on 2019-06-11 21:01

Can this package be updated?

FabioLolix commented on 2018-02-24 12:36

@racko I see there are several red marked dependencies for gazebo but at least ignition-common, ignition-math and ignition-cmake install with yaourt; maybe is a temporary aur webpages quirks.

If naming scheme is far from ideal in source or other places don't mean must be replicated here :)

Issues are not related