Package Details: hsakmt-roct 1.8.0.r0.e3dd067-2

Git Clone URL: https://aur.archlinux.org/hsakmt-roct.git (read-only)
Package Base: hsakmt-roct
Description: Radeon Open Compute Thunk Interface
Upstream URL: https://github.com/RadeonOpenCompute/ROCT-Thunk-Interface
Licenses: X11/MIT
Conflicts: hsakmt-roct
Provides: hsakmt-roct
Submitter: leidola
Maintainer: ljmf00
Last Packager: leidola
Votes: 7
Popularity: 0.003940
First Submitted: 2017-07-25 17:56
Last Updated: 2018-06-06 23:44

Latest Comments

naetherm commented on 2019-10-29 06:10

Created PKGBUILD for version 2.9.x: https://gist.github.com/naetherm/8dce0d9d8873a2b8ee1fcd00f829ed08

clap22 commented on 2018-12-04 01:54

@leidola also need maintenance privs here

marcs commented on 2017-12-11 15:52

not sure why but symbolic links don't work for me, path seems fine but the link misdirect, i built the package using makepkg.

leidola commented on 2017-10-29 20:07

@cdkitching: Thanks for pointing out; fixed

@znmeb: It's fixed in some upstream branch; Patch is now cherry-picked

cdkitching commented on 2017-10-28 05:58

makedepends=('git cmake gcc')

^- This is not how you do an array in bash.

znmeb commented on 2017-10-25 07:32

Seems like it used to compile on my machine - maybe it's not happy with the latest GCC.

znmeb commented on 2017-10-25 07:21

The compile is failing:


==> Downloading hsakmt-roct PKGBUILD from AUR...
x .SRCINFO
x PKGBUILD
hsakmt-roct 1.6.1.r0.a65d730-2 (2017-07-25 19:44)
( Unsupported package: Potentially dangerous ! )
==> hsakmt-roct dependencies:
- pciutils (already installed)
- git cmake gcc (already installed) [makedepend]
- git (package found)
- cmake (package found)
- gcc (package found)


==> Continue building hsakmt-roct ? [Y/n]
==> -------------------------------------
==>
==> Building and installing package
==> Install or build missing dependencies for hsakmt-roct:
no targets specified.
Query alpm database and/or AUR
Usage: package-query [options] [targets ...]
More information: package-query --help

==> Making package: hsakmt-roct 1.6.1.r0.a65d730-2 (Wed Oct 25 00:17:08 PDT 2017)
==> Checking runtime dependencies...
==> Checking buildtime dependencies...
==> Retrieving sources...
-> Cloning ROCT-Thunk-Interface git repo...
Cloning into bare repository '/TMPDIR/yaourt-tmp-znmeb/aur-hsakmt-roct/ROCT-Thunk-Interface'...
remote: Counting objects: 1697, done.
remote: Compressing objects: 100% (4/4), done.
remote: Total 1697 (delta 0), reused 2 (delta 0), pack-reused 1692
Receiving objects: 100% (1697/1697), 513.66 KiB | 4.50 MiB/s, done.
Resolving deltas: 100% (1091/1091), done.
==> Validating source files with md5sums...
ROCT-Thunk-Interface ... Skipped
==> Extracting sources...
-> Creating working copy of ROCT-Thunk-Interface git repo...
Cloning into 'ROCT-Thunk-Interface'...
done.
Switched to a new branch 'makepkg'
==> Starting pkgver()...
==> Updated version: hsakmt-roct 1.6.3.r0.25a9bc2-1
==> Starting build()...
-- The C compiler identification is GNU 7.2.0
-- The CXX compiler identification is GNU 7.2.0
-- Check for working C compiler: /usr/bin/cc
-- Check for working C compiler: /usr/bin/cc -- works
-- Detecting C compiler ABI info
-- Detecting C compiler ABI info - done
-- Detecting C compile features
-- Detecting C compile features - done
-- Check for working CXX compiler: /usr/bin/c++
-- Check for working CXX compiler: /usr/bin/c++ -- works
-- Detecting CXX compiler ABI info
-- Detecting CXX compiler ABI info - done
-- Detecting CXX compile features
-- Detecting CXX compile features - done
VERSION BUILD DEFINED 14-g25a9bc2
-- Configuring done
-- Generating done
-- Build files have been written to: /TMPDIR/yaourt-tmp-znmeb/aur-hsakmt-roct/src/ROCT-Thunk-Interface/build
/usr/bin/cmake -H/TMPDIR/yaourt-tmp-znmeb/aur-hsakmt-roct/src/ROCT-Thunk-Interface -B/TMPDIR/yaourt-tmp-znmeb/aur-hsakmt-roct/src/ROCT-Thunk-Interface/build --check-build-system CMakeFiles/Makefile.cmake 0
/usr/bin/cmake -E cmake_progress_start /TMPDIR/yaourt-tmp-znmeb/aur-hsakmt-roct/src/ROCT-Thunk-Interface/build/CMakeFiles /TMPDIR/yaourt-tmp-znmeb/aur-hsakmt-roct/src/ROCT-Thunk-Interface/build/CMakeFiles/progress.marks
make -f CMakeFiles/Makefile2 all
make[1]: Entering directory '/TMPDIR/yaourt-tmp-znmeb/aur-hsakmt-roct/src/ROCT-Thunk-Interface/build'
make -f CMakeFiles/libhsakmt.dir/build.make CMakeFiles/libhsakmt.dir/depend
make -f CMakeFiles/libhsakmt.so-link.dir/build.make CMakeFiles/libhsakmt.so-link.dir/depend
make -f CMakeFiles/hsakmt.dir/build.make CMakeFiles/hsakmt.dir/depend
make[2]: Entering directory '/TMPDIR/yaourt-tmp-znmeb/aur-hsakmt-roct/src/ROCT-Thunk-Interface/build'
cd /TMPDIR/yaourt-tmp-znmeb/aur-hsakmt-roct/src/ROCT-Thunk-Interface/build && /usr/bin/cmake -E cmake_depends "Unix Makefiles" /TMPDIR/yaourt-tmp-znmeb/aur-hsakmt-roct/src/ROCT-Thunk-Interface /TMPDIR/yaourt-tmp-znmeb/aur-hsakmt-roct/src/ROCT-Thunk-Interface /TMPDIR/yaourt-tmp-znmeb/aur-hsakmt-roct/src/ROCT-Thunk-Interface/build /TMPDIR/yaourt-tmp-znmeb/aur-hsakmt-roct/src/ROCT-Thunk-Interface/build /TMPDIR/yaourt-tmp-znmeb/aur-hsakmt-roct/src/ROCT-Thunk-Interface/build/CMakeFiles/libhsakmt.dir/DependInfo.cmake --color=
make[2]: Entering directory '/TMPDIR/yaourt-tmp-znmeb/aur-hsakmt-roct/src/ROCT-Thunk-Interface/build'
cd /TMPDIR/yaourt-tmp-znmeb/aur-hsakmt-roct/src/ROCT-Thunk-Interface/build && /usr/bin/cmake -E cmake_depends "Unix Makefiles" /TMPDIR/yaourt-tmp-znmeb/aur-hsakmt-roct/src/ROCT-Thunk-Interface /TMPDIR/yaourt-tmp-znmeb/aur-hsakmt-roct/src/ROCT-Thunk-Interface /TMPDIR/yaourt-tmp-znmeb/aur-hsakmt-roct/src/ROCT-Thunk-Interface/build /TMPDIR/yaourt-tmp-znmeb/aur-hsakmt-roct/src/ROCT-Thunk-Interface/build /TMPDIR/yaourt-tmp-znmeb/aur-hsakmt-roct/src/ROCT-Thunk-Interface/build/CMakeFiles/hsakmt.dir/DependInfo.cmake --color=
make[2]: Entering directory '/TMPDIR/yaourt-tmp-znmeb/aur-hsakmt-roct/src/ROCT-Thunk-Interface/build'
cd /TMPDIR/yaourt-tmp-znmeb/aur-hsakmt-roct/src/ROCT-Thunk-Interface/build && /usr/bin/cmake -E cmake_depends "Unix Makefiles" /TMPDIR/yaourt-tmp-znmeb/aur-hsakmt-roct/src/ROCT-Thunk-Interface /TMPDIR/yaourt-tmp-znmeb/aur-hsakmt-roct/src/ROCT-Thunk-Interface /TMPDIR/yaourt-tmp-znmeb/aur-hsakmt-roct/src/ROCT-Thunk-Interface/build /TMPDIR/yaourt-tmp-znmeb/aur-hsakmt-roct/src/ROCT-Thunk-Interface/build /TMPDIR/yaourt-tmp-znmeb/aur-hsakmt-roct/src/ROCT-Thunk-Interface/build/CMakeFiles/libhsakmt.so-link.dir/DependInfo.cmake --color=
Scanning dependencies of target libhsakmt
Scanning dependencies of target libhsakmt.so-link
Scanning dependencies of target hsakmt
make[2]: Leaving directory '/TMPDIR/yaourt-tmp-znmeb/aur-hsakmt-roct/src/ROCT-Thunk-Interface/build'
make -f CMakeFiles/libhsakmt.dir/build.make CMakeFiles/libhsakmt.dir/build
make[2]: Leaving directory '/TMPDIR/yaourt-tmp-znmeb/aur-hsakmt-roct/src/ROCT-Thunk-Interface/build'
make -f CMakeFiles/libhsakmt.so-link.dir/build.make CMakeFiles/libhsakmt.so-link.dir/build
make[2]: Entering directory '/TMPDIR/yaourt-tmp-znmeb/aur-hsakmt-roct/src/ROCT-Thunk-Interface/build'
/usr/bin/cmake -E create_symlink ../libhsakmt/include/libhsakmt libhsakmt-link
make[2]: Entering directory '/TMPDIR/yaourt-tmp-znmeb/aur-hsakmt-roct/src/ROCT-Thunk-Interface/build'
/usr/bin/cmake -E create_symlink ../libhsakmt/lib/libhsakmt.so libhsakmt.so-link
make[2]: Leaving directory '/TMPDIR/yaourt-tmp-znmeb/aur-hsakmt-roct/src/ROCT-Thunk-Interface/build'
make -f CMakeFiles/hsakmt.dir/build.make CMakeFiles/hsakmt.dir/build
make[2]: Leaving directory '/TMPDIR/yaourt-tmp-znmeb/aur-hsakmt-roct/src/ROCT-Thunk-Interface/build'
make[2]: Leaving directory '/TMPDIR/yaourt-tmp-znmeb/aur-hsakmt-roct/src/ROCT-Thunk-Interface/build'
make[2]: Entering directory '/TMPDIR/yaourt-tmp-znmeb/aur-hsakmt-roct/src/ROCT-Thunk-Interface/build'
[ 0%] Built target libhsakmt.so-link
[ 0%] Built target libhsakmt
[ 14%] Building C object CMakeFiles/hsakmt.dir/src/fmm.c.o
[ 14%] Building C object CMakeFiles/hsakmt.dir/src/events.c.o
/usr/bin/cc -Dhsakmt_EXPORTS -I/TMPDIR/yaourt-tmp-znmeb/aur-hsakmt-roct/src/ROCT-Thunk-Interface/include -I/TMPDIR/yaourt-tmp-znmeb/aur-hsakmt-roct/src/ROCT-Thunk-Interface/src -fPIC -W -Wall -Wextra -Werror -Wno-unused-parameter -Wformat-security -Wswitch-default -Wundef -Wshadow -Wpointer-arith -Wbad-function-cast -Wcast-qual -Wlogical-op -Wstrict-prototypes -Wmissing-prototypes -Wmissing-declarations -Wredundant-decls -Wunreachable-code -std=gnu99 -fvisibility=hidden -O2 -fPIC -o CMakeFiles/hsakmt.dir/src/events.c.o -c /TMPDIR/yaourt-tmp-znmeb/aur-hsakmt-roct/src/ROCT-Thunk-Interface/src/events.c
/usr/bin/cc -Dhsakmt_EXPORTS -I/TMPDIR/yaourt-tmp-znmeb/aur-hsakmt-roct/src/ROCT-Thunk-Interface/include -I/TMPDIR/yaourt-tmp-znmeb/aur-hsakmt-roct/src/ROCT-Thunk-Interface/src -fPIC -W -Wall -Wextra -Werror -Wno-unused-parameter -Wformat-security -Wswitch-default -Wundef -Wshadow -Wpointer-arith -Wbad-function-cast -Wcast-qual -Wlogical-op -Wstrict-prototypes -Wmissing-prototypes -Wmissing-declarations -Wredundant-decls -Wunreachable-code -std=gnu99 -fvisibility=hidden -O2 -fPIC -o CMakeFiles/hsakmt.dir/src/fmm.c.o -c /TMPDIR/yaourt-tmp-znmeb/aur-hsakmt-roct/src/ROCT-Thunk-Interface/src/fmm.c
[ 21%] Building C object CMakeFiles/hsakmt.dir/src/globals.c.o
/usr/bin/cc -Dhsakmt_EXPORTS -I/TMPDIR/yaourt-tmp-znmeb/aur-hsakmt-roct/src/ROCT-Thunk-Interface/include -I/TMPDIR/yaourt-tmp-znmeb/aur-hsakmt-roct/src/ROCT-Thunk-Interface/src -fPIC -W -Wall -Wextra -Werror -Wno-unused-parameter -Wformat-security -Wswitch-default -Wundef -Wshadow -Wpointer-arith -Wbad-function-cast -Wcast-qual -Wlogical-op -Wstrict-prototypes -Wmissing-prototypes -Wmissing-declarations -Wredundant-decls -Wunreachable-code -std=gnu99 -fvisibility=hidden -O2 -fPIC -o CMakeFiles/hsakmt.dir/src/globals.c.o -c /TMPDIR/yaourt-tmp-znmeb/aur-hsakmt-roct/src/ROCT-Thunk-Interface/src/globals.c
[ 28%] Building C object CMakeFiles/hsakmt.dir/src/debug.c.o
/usr/bin/cc -Dhsakmt_EXPORTS -I/TMPDIR/yaourt-tmp-znmeb/aur-hsakmt-roct/src/ROCT-Thunk-Interface/include -I/TMPDIR/yaourt-tmp-znmeb/aur-hsakmt-roct/src/ROCT-Thunk-Interface/src -fPIC -W -Wall -Wextra -Werror -Wno-unused-parameter -Wformat-security -Wswitch-default -Wundef -Wshadow -Wpointer-arith -Wbad-function-cast -Wcast-qual -Wlogical-op -Wstrict-prototypes -Wmissing-prototypes -Wmissing-declarations -Wredundant-decls -Wunreachable-code -std=gnu99 -fvisibility=hidden -O2 -fPIC -o CMakeFiles/hsakmt.dir/src/debug.c.o -c /TMPDIR/yaourt-tmp-znmeb/aur-hsakmt-roct/src/ROCT-Thunk-Interface/src/debug.c
[ 35%] Building C object CMakeFiles/hsakmt.dir/src/openclose.c.o
/usr/bin/cc -Dhsakmt_EXPORTS -I/TMPDIR/yaourt-tmp-znmeb/aur-hsakmt-roct/src/ROCT-Thunk-Interface/include -I/TMPDIR/yaourt-tmp-znmeb/aur-hsakmt-roct/src/ROCT-Thunk-Interface/src -fPIC -W -Wall -Wextra -Werror -Wno-unused-parameter -Wformat-security -Wswitch-default -Wundef -Wshadow -Wpointer-arith -Wbad-function-cast -Wcast-qual -Wlogical-op -Wstrict-prototypes -Wmissing-prototypes -Wmissing-declarations -Wredundant-decls -Wunreachable-code -std=gnu99 -fvisibility=hidden -O2 -fPIC -o CMakeFiles/hsakmt.dir/src/openclose.c.o -c /TMPDIR/yaourt-tmp-znmeb/aur-hsakmt-roct/src/ROCT-Thunk-Interface/src/openclose.c
[ 42%] Building C object CMakeFiles/hsakmt.dir/src/libhsakmt.c.o
/usr/bin/cc -Dhsakmt_EXPORTS -I/TMPDIR/yaourt-tmp-znmeb/aur-hsakmt-roct/src/ROCT-Thunk-Interface/include -I/TMPDIR/yaourt-tmp-znmeb/aur-hsakmt-roct/src/ROCT-Thunk-Interface/src -fPIC -W -Wall -Wextra -Werror -Wno-unused-parameter -Wformat-security -Wswitch-default -Wundef -Wshadow -Wpointer-arith -Wbad-function-cast -Wcast-qual -Wlogical-op -Wstrict-prototypes -Wmissing-prototypes -Wmissing-declarations -Wredundant-decls -Wunreachable-code -std=gnu99 -fvisibility=hidden -O2 -fPIC -o CMakeFiles/hsakmt.dir/src/libhsakmt.c.o -c /TMPDIR/yaourt-tmp-znmeb/aur-hsakmt-roct/src/ROCT-Thunk-Interface/src/libhsakmt.c
[ 50%] Building C object CMakeFiles/hsakmt.dir/src/memory.c.o
/usr/bin/cc -Dhsakmt_EXPORTS -I/TMPDIR/yaourt-tmp-znmeb/aur-hsakmt-roct/src/ROCT-Thunk-Interface/include -I/TMPDIR/yaourt-tmp-znmeb/aur-hsakmt-roct/src/ROCT-Thunk-Interface/src -fPIC -W -Wall -Wextra -Werror -Wno-unused-parameter -Wformat-security -Wswitch-default -Wundef -Wshadow -Wpointer-arith -Wbad-function-cast -Wcast-qual -Wlogical-op -Wstrict-prototypes -Wmissing-prototypes -Wmissing-declarations -Wredundant-decls -Wunreachable-code -std=gnu99 -fvisibility=hidden -O2 -fPIC -o CMakeFiles/hsakmt.dir/src/memory.c.o -c /TMPDIR/yaourt-tmp-znmeb/aur-hsakmt-roct/src/ROCT-Thunk-Interface/src/memory.c
[ 57%] Building C object CMakeFiles/hsakmt.dir/src/perfctr.c.o
/usr/bin/cc -Dhsakmt_EXPORTS -I/TMPDIR/yaourt-tmp-znmeb/aur-hsakmt-roct/src/ROCT-Thunk-Interface/include -I/TMPDIR/yaourt-tmp-znmeb/aur-hsakmt-roct/src/ROCT-Thunk-Interface/src -fPIC -W -Wall -Wextra -Werror -Wno-unused-parameter -Wformat-security -Wswitch-default -Wundef -Wshadow -Wpointer-arith -Wbad-function-cast -Wcast-qual -Wlogical-op -Wstrict-prototypes -Wmissing-prototypes -Wmissing-declarations -Wredundant-decls -Wunreachable-code -std=gnu99 -fvisibility=hidden -O2 -fPIC -o CMakeFiles/hsakmt.dir/src/perfctr.c.o -c /TMPDIR/yaourt-tmp-znmeb/aur-hsakmt-roct/src/ROCT-Thunk-Interface/src/perfctr.c
[ 64%] Building C object CMakeFiles/hsakmt.dir/src/pmc_table.c.o
/usr/bin/cc -Dhsakmt_EXPORTS -I/TMPDIR/yaourt-tmp-znmeb/aur-hsakmt-roct/src/ROCT-Thunk-Interface/include -I/TMPDIR/yaourt-tmp-znmeb/aur-hsakmt-roct/src/ROCT-Thunk-Interface/src -fPIC -W -Wall -Wextra -Werror -Wno-unused-parameter -Wformat-security -Wswitch-default -Wundef -Wshadow -Wpointer-arith -Wbad-function-cast -Wcast-qual -Wlogical-op -Wstrict-prototypes -Wmissing-prototypes -Wmissing-declarations -Wredundant-decls -Wunreachable-code -std=gnu99 -fvisibility=hidden -O2 -fPIC -o CMakeFiles/hsakmt.dir/src/pmc_table.c.o -c /TMPDIR/yaourt-tmp-znmeb/aur-hsakmt-roct/src/ROCT-Thunk-Interface/src/pmc_table.c
/TMPDIR/yaourt-tmp-znmeb/aur-hsakmt-roct/src/ROCT-Thunk-Interface/src/perfctr.c: In function ‘destroy_shared_region’:
/TMPDIR/yaourt-tmp-znmeb/aur-hsakmt-roct/src/ROCT-Thunk-Interface/src/perfctr.c:154:10: error: logical ‘and’ of equal expressions [-Werror=logical-op]
if (sem && sem != SEM_FAILED) {
^~
/TMPDIR/yaourt-tmp-znmeb/aur-hsakmt-roct/src/ROCT-Thunk-Interface/src/perfctr.c: In function ‘update_block_slots’:
/TMPDIR/yaourt-tmp-znmeb/aur-hsakmt-roct/src/ROCT-Thunk-Interface/src/perfctr.c:323:11: error: logical ‘or’ of equal expressions [-Werror=logical-op]
if (!sem || sem == SEM_FAILED)
^~
[ 71%] Building C object CMakeFiles/hsakmt.dir/src/queues.c.o
/usr/bin/cc -Dhsakmt_EXPORTS -I/TMPDIR/yaourt-tmp-znmeb/aur-hsakmt-roct/src/ROCT-Thunk-Interface/include -I/TMPDIR/yaourt-tmp-znmeb/aur-hsakmt-roct/src/ROCT-Thunk-Interface/src -fPIC -W -Wall -Wextra -Werror -Wno-unused-parameter -Wformat-security -Wswitch-default -Wundef -Wshadow -Wpointer-arith -Wbad-function-cast -Wcast-qual -Wlogical-op -Wstrict-prototypes -Wmissing-prototypes -Wmissing-declarations -Wredundant-decls -Wunreachable-code -std=gnu99 -fvisibility=hidden -O2 -fPIC -o CMakeFiles/hsakmt.dir/src/queues.c.o -c /TMPDIR/yaourt-tmp-znmeb/aur-hsakmt-roct/src/ROCT-Thunk-Interface/src/queues.c
[ 78%] Building C object CMakeFiles/hsakmt.dir/src/time.c.o
/usr/bin/cc -Dhsakmt_EXPORTS -I/TMPDIR/yaourt-tmp-znmeb/aur-hsakmt-roct/src/ROCT-Thunk-Interface/include -I/TMPDIR/yaourt-tmp-znmeb/aur-hsakmt-roct/src/ROCT-Thunk-Interface/src -fPIC -W -Wall -Wextra -Werror -Wno-unused-parameter -Wformat-security -Wswitch-default -Wundef -Wshadow -Wpointer-arith -Wbad-function-cast -Wcast-qual -Wlogical-op -Wstrict-prototypes -Wmissing-prototypes -Wmissing-declarations -Wredundant-decls -Wunreachable-code -std=gnu99 -fvisibility=hidden -O2 -fPIC -o CMakeFiles/hsakmt.dir/src/time.c.o -c /TMPDIR/yaourt-tmp-znmeb/aur-hsakmt-roct/src/ROCT-Thunk-Interface/src/time.c
[ 85%] Building C object CMakeFiles/hsakmt.dir/src/topology.c.o
/usr/bin/cc -Dhsakmt_EXPORTS -I/TMPDIR/yaourt-tmp-znmeb/aur-hsakmt-roct/src/ROCT-Thunk-Interface/include -I/TMPDIR/yaourt-tmp-znmeb/aur-hsakmt-roct/src/ROCT-Thunk-Interface/src -fPIC -W -Wall -Wextra -Werror -Wno-unused-parameter -Wformat-security -Wswitch-default -Wundef -Wshadow -Wpointer-arith -Wbad-function-cast -Wcast-qual -Wlogical-op -Wstrict-prototypes -Wmissing-prototypes -Wmissing-declarations -Wredundant-decls -Wunreachable-code -std=gnu99 -fvisibility=hidden -O2 -fPIC -o CMakeFiles/hsakmt.dir/src/topology.c.o -c /TMPDIR/yaourt-tmp-znmeb/aur-hsakmt-roct/src/ROCT-Thunk-Interface/src/topology.c
[ 92%] Building C object CMakeFiles/hsakmt.dir/src/version.c.o
/usr/bin/cc -Dhsakmt_EXPORTS -I/TMPDIR/yaourt-tmp-znmeb/aur-hsakmt-roct/src/ROCT-Thunk-Interface/include -I/TMPDIR/yaourt-tmp-znmeb/aur-hsakmt-roct/src/ROCT-Thunk-Interface/src -fPIC -W -Wall -Wextra -Werror -Wno-unused-parameter -Wformat-security -Wswitch-default -Wundef -Wshadow -Wpointer-arith -Wbad-function-cast -Wcast-qual -Wlogical-op -Wstrict-prototypes -Wmissing-prototypes -Wmissing-declarations -Wredundant-decls -Wunreachable-code -std=gnu99 -fvisibility=hidden -O2 -fPIC -o CMakeFiles/hsakmt.dir/src/version.c.o -c /TMPDIR/yaourt-tmp-znmeb/aur-hsakmt-roct/src/ROCT-Thunk-Interface/src/version.c
cc1: all warnings being treated as errors
make[2]: *** [CMakeFiles/hsakmt.dir/build.make:234: CMakeFiles/hsakmt.dir/src/perfctr.c.o] Error 1
make[2]: *** Waiting for unfinished jobs....
make[2]: Leaving directory '/TMPDIR/yaourt-tmp-znmeb/aur-hsakmt-roct/src/ROCT-Thunk-Interface/build'
make[1]: *** [CMakeFiles/Makefile2:145: CMakeFiles/hsakmt.dir/all] Error 2
make[1]: Leaving directory '/TMPDIR/yaourt-tmp-znmeb/aur-hsakmt-roct/src/ROCT-Thunk-Interface/build'
make: *** [Makefile:155: all] Error 2
==> ERROR: A failure occurred in build().
Aborting...
==> ERROR: Makepkg was unable to build hsakmt-roct.
==> Restart building hsakmt-roct ? [y/N]
==> ------------------------------------