Package Details: gxneur 0.20.0-2

Git Clone URL: https://aur.archlinux.org/gxneur.git (read-only, click to copy)
Package Base: gxneur
Description: GTK frontend for XNeur
Upstream URL: http://www.xneur.ru
Licenses: GPL
Submitter: None
Maintainer: cucullus
Last Packager: cucullus
Votes: 71
Popularity: 0.003796
First Submitted: 2006-11-15 21:39
Last Updated: 2017-04-09 14:15

Latest Comments

« First ‹ Previous 1 2 3 4 Next › Last »

Aspiring commented on 2012-04-27 14:09

"gxneur: error while loading shared libraries: libpcre.so.0: cannot open shared object file: No such file or directory"
>>>
#cd /usr/lib/
#cp libpcre.so libpcre.so.0
Enjoy!

Aspiring commented on 2012-04-27 14:02

"gxneur: error while loading shared libraries: libpcre.so.0: cannot open shared object file: No such file or directory"
>>>
#cd /usr/lib/
#cp libpcre.so libpcre.so.0
Enjoy!

Anonymous comment on 2012-03-20 18:49

But you maybe could make a bugfix release?
I'm installing with yaourt, and when i edit the Makefile and try again, the archive unpacks again and the Make overrites...

cucullus commented on 2012-03-20 14:25

Ask devs about new versions.

To fix compilation errors try to delete -Wall or something like that in CFLAGS (in Makefile)

Anonymous comment on 2012-03-20 11:42

OK, when will it arrive?
When wiil be the compile bug fixed?

cucullus commented on 2012-03-19 15:08

Dmitry, please do not flag until new version arrives.

Anonymous comment on 2012-03-17 16:38

event.c: In function 'event_get_cur_keysym':
event.c:144:2: error: 'XKeycodeToKeysym' is deprecated (declared at /usr/include/X11/Xlib.h:1695) [-Werror=deprecated-declarations]
cc1: all warnings being treated as errors
make[3]: *** [libxnmain_la-event.lo] Ошибка 1
make[3]: Выход из каталога `/tmp/yaourt-tmp-dmitry/aur-xneur/src/xneur-0.15.0/lib/main'
make[2]: *** [all-recursive] Ошибка 1
make[2]: Выход из каталога `/tmp/yaourt-tmp-dmitry/aur-xneur/src/xneur-0.15.0/lib'
make[1]: *** [all-recursive] Ошибка 1
make[1]: Выход из каталога `/tmp/yaourt-tmp-dmitry/aur-xneur/src/xneur-0.15.0'
make: *** [all] Ошибка 2
==> ОШИБКА: Произошел сбой в build().
Преждевременный выход...
==> ERROR: Makepkg was unable to build xneur.

VVS commented on 2012-03-03 17:21

gxneur: error while loading shared libraries: libpcre.so.0: cannot open shared object file: No such file or directory

VVS commented on 2012-03-03 17:16

gxneur: error while loading shared libraries: libpcre.so.0: cannot open shared object file: No such file or directory

Anonymous comment on 2012-02-22 03:21

Quick fix to compile vs. libx11 1.4.99.1

https://gist.github.com/1881050