Package Details: gtk-arc-flatabulous-theme-git 20180201.r0.g0492475-1

Git Clone URL: https://aur.archlinux.org/gtk-arc-flatabulous-theme-git.git (read-only)
Package Base: gtk-arc-flatabulous-theme-git
Description: Arc theme with Flatabulous window controls.
Upstream URL: https://github.com/andreisergiu98/arc-flatabulous-theme
Keywords: theme
Licenses: GPL3
Conflicts: gtk-arc-flatabulous-theme
Provides: gtk-arc-flatabulous-theme
Submitter: orestisf
Maintainer: Gioconda
Last Packager: Gioconda
Votes: 29
Popularity: 1.82
First Submitted: 2016-04-10 11:57
Last Updated: 2018-02-01 23:25

Latest Comments

trinaldi commented on 2019-08-13 02:09

@electricprism, I was not able to reproduce the error.

I installed trough yay and pure git clone (Following the instructions from README).

Did you add any extra options?

A quick search for your error inkscape: error while loading shared libraries: libpoppler.so suggests that it might be a problem with Inkscape itself.

electricprism commented on 2019-08-02 18:20

/usr/bin/inkscape: error while loading shared libraries: libpoppler.so.87: cannot open shared object file: No such file or directory /usr/bin/inkscape: error while loading shared libraries: libpoppler.so.87: cannot open shared object file: No such file or directory /usr/bin/inkscape: error while loading shared libraries: libpoppler.so.87/usr/bin/inkscape: error while loading shared libraries: : libpoppler.so.87: cannot open shared object file: No such file or directory cannot open shared object filemake[2]: [Makefile:731: light/assets/arrow-down-small-insens.png] Error 127 : No such file or directory make[2]: [Makefile:731: light/assets/arrow-right-insens.png] Error 127 make[2]: [Makefile:731: light/assets/arrow-down-small-prelight.png] Error 127 make[2]: [Makefile:731: light/assets/arrow-up-prelight.png] Error 127 make[2]: [Makefile:731: light/assets/arrow-up-insens.png] Error 127 make[2]: [Makefile:731: light/assets/arrow-up-small.png] Error 127 /usr/bin/inkscape: error while loading shared libraries: libpoppler.so.87: cannot open shared object file: No such file or directory make[2]: [Makefile:731: light/assets/arrow-up-small-prelight.png] Error 127 /usr/bin/inkscape: error while loading shared libraries: libpoppler.so.87: cannot open shared object file: No such file or directory /usr/bin/inkscape: error while loading shared libraries: libpoppler.so.87: cannot open shared object file: No such file or directory /usr/bin/inkscape: error while loading shared libraries: libpoppler.so.87: cannot open shared object file: No such file or directory make[2]: [Makefile:731: light/assets/arrow-up-small-insens.png] Error 127 make[2]: [Makefile:731: light/assets/menu-arrow.png] Error 127 make[2]: [Makefile:731: light/assets/button.png] Error 127 make[2]: [Makefile:731: light/assets/menu-arrow-prelight.png] Error 127 make[2]: [Makefile:731: light/assets/button-hover.png] Error 127 make[2]: Leaving directory '/Profiles/Loren/Account/.cache/yay/gtk-arc-flatabulous-theme-git/src/arc-flatabulous-theme/common/gtk-2.0' make[1]: [Makefile:435: install-recursive] Error 1 make[1]: Leaving directory '/Profiles/Loren/Account/.cache/yay/gtk-arc-flatabulous-theme-git/src/arc-flatabulous-theme/common' make: [Makefile:360: install-recursive] Error 1 ==> ERROR: A failure occurred in package(). Aborting... Error making: gtk-arc-flatabulous-theme-git

gnaggnoyil commented on 2019-04-29 13:37

Just for a site note, one has to specify environment variable OPTION_GTK2_HIDPI to "true" when running makepkg in order that the build process would generate icons under dpi 196 for xfwm themes.

ivdok commented on 2019-04-23 20:30

Consider adding 'inkscape' to makedepends if your build is failing. Also, if you're using DE other than Gnome3, you can add following arguments to build(./configure --prefix=/usr), right before the prefix: --disable-gnome-shell --with-gtk3=3.24, and so on, as described on the upstream's README.

Gioconda commented on 2018-03-25 22:18

Hi @trinaldi, you should describe that problem in the upstream(https://github.com/andreisergiu98/arc-flatabulous-theme/issues)

trinaldi commented on 2018-03-25 16:10

I'm getting transparent dialog and top panel with GNOME 3.28.

Gioconda commented on 2018-02-01 22:38

Updated with new release!

Anonymous comment on 2016-05-25 06:24

Sorry about that, I did not set up the version number correctly. It should be fixed now.

vith commented on 2016-05-25 06:13

pacaur always rebuilds and reinstalls this package because the pkgver function returns a value (563.23051a8-1) less than the original (20160513-1).

If that's intentional, maybe the package should be suffixed with -always?

If not, this and https://aur.archlinux.org/packages/gtk-arc-flatabulous-theme-git/ should probably merge.