Package Details: gstreamer0.10 0.10.36-17

Git Clone URL: (read-only, click to copy)
Package Base: gstreamer0.10
Description: GStreamer Multimedia Framework
Upstream URL:
Licenses: LGPL
Submitter: yurikoles
Maintainer: ava1ar
Last Packager: ava1ar
Votes: 116
Popularity: 1.51
First Submitted: 2017-01-26 13:42
Last Updated: 2017-10-04 04:50

Latest Comments

1 2 3 4 5 6 ... Next › Last »

jaysee commented on 2019-03-17 16:36

Missing dependency python. Cannot build in a chroot.

make[1]: Entering directory '/build/lib32-gstreamer0.10/src/gstreamer'                                       
Making all in pkgconfig              
make[2]: Entering directory '/build/lib32-gstreamer0.10/src/gstreamer/pkgconfig'                             
  CP     gstreamer-check-0.10.pc         
  CP     gstreamer-0.10.pc                                                                                   
  CP     gstreamer-base-0.10.pc                 
  CP     gstreamer-controller-0.10.pc                                                                        
  CP     gstreamer-dataprotocol-0.10.pc      
  CP     gstreamer-net-0.10.pc              
  CP     gstreamer-0.10-uninstalled.pc   
  CP     gstreamer-base-0.10-uninstalled.pc                                                                  
  CP     gstreamer-controller-0.10-uninstalled.pc
  CP     gstreamer-dataprotocol-0.10-uninstalled.pc
  CP     gstreamer-check-0.10-uninstalled.pc
  CP     gstreamer-net-0.10-uninstalled.pc                                                                   
make[2]: Leaving directory '/build/lib32-gstreamer0.10/src/gstreamer/pkgconfig'                              
Making all in gst                                                                                            
make[2]: Entering directory '/build/lib32-gstreamer0.10/src/gstreamer/gst'                                   
  GEN      gstenumtypes.h                                                                                    
  GEN      gstmarshal.h                                                                                      
/usr/bin/env: /usr/bin/env: ‘python3’‘python3’: No such file or directory                                    
: No such file or directory                                                                                  
  GEN      gstenumtypes.c                                                                                    
  GEN      gstmarshal.c                                              
make[2]: *** [Makefile:1988: gstmarshal.h] Error 127       
make[2]: *** Waiting for unfinished jobs....                                                                 
make[2]: *** [Makefile:1999: gstenumtypes.h] Error 127
/usr/bin/env: ‘python3’: No such file or directory/usr/bin/env: ‘python3’: No such file or directory         

make[2]: *** [Makefile:1992: gstmarshal.c] Error 127                                                         
make[2]: *** [Makefile:2007: gstenumtypes.c] Error 127                                                       
make[2]: Leaving directory '/build/lib32-gstreamer0.10/src/gstreamer/gst'                                    
make[1]: *** [Makefile:751: all-recursive] Error 1
make[1]: Leaving directory '/build/lib32-gstreamer0.10/src/gstreamer'                                        
make: *** [Makefile:655: all] Error 2
==> ERROR: A failure occurred in build().
==> ERROR: Build failed, check /home/build/aur-builder/chroot/538617/build/build
Error executing command: makechrootpkg -c -r /home/build/aur-builder/chroot/538617

ava1ar commented on 2019-03-16 03:41


You are installing wrong archive: gstreamer-0.10.36.tar.xz is an archive with source code, you need to install gstreamer0.10-0.10.36-17-x86_64.pkg.tar.xz, which is package being built.

kinetik commented on 2019-03-15 18:15

makepkg -s goes without any issues, but when I try to finish the installation I get the following:

loading packages...
error: missing package metadata in gstreamer-0.10.36.tar.xz
error: 'gstreamer-0.10.36.tar.xz': invalid or corrupted package

Any suggestions?

andreas_baumann commented on 2018-06-30 07:23

On 32-bit I get:

/usr/lib/gcc/i686-pc-linux-gnu/7.3.1/include/xmmintrin.h:785:1: error: inlining failed in call to always_inline ‘_mm_movehl_ps’: target specific option mismatch
 _mm_movehl_ps (__m128 __A, __m128 __B)

Disabling _USE_SSE and _USE_SSE2 in gst/audioresample/speex_resampler_double.c and gst/audioresample/speex_resampler_float.c made it compile, but it feels like not the right fix.

ava1ar commented on 2018-03-10 01:07


These two packages are part of the base-devel group, which you must install if you want to use AUR. Please red

ganthore commented on 2018-03-10 01:01

Build fails because bison and flex were not pulled in by the package manager before installation. Please try and fix that in your package requirements list. :-)

ankitrgadiya commented on 2017-10-04 04:54

Scimmia, ava1ar I didn't know that sorry

ava1ar commented on 2017-10-04 04:51

Scimmia, you are right. Shame on me, I forgot this. Anyway, I cleaned up all makedepends, which are part of base-devel group. Thanks for the hint!

Scimmia commented on 2017-10-04 04:44

Which was a mistake. Don't cater to people who don't know what they're doing, the base-devel group is to be assumed at build time.

ava1ar commented on 2017-10-04 04:41

ankitrgadiya, done.