Package Details: grub2-editor-frameworks-git 0.8.1.r0.g2f7de2c-2

Git Clone URL: (read-only, click to copy)
Package Base: grub2-editor-frameworks-git
Description: A KDE Control Module for configuring the GRUB2 bootloader. Unofficial KF5 port.
Upstream URL:
Keywords: grub grub2 kde
Licenses: GPL
Groups: plasma
Conflicts: grub2-editor
Provides: grub2-editor
Submitter: yurikoles
Maintainer: yurikoles
Last Packager: yurikoles
Votes: 24
Popularity: 0.068394
First Submitted: 2020-03-24 06:36
Last Updated: 2020-04-18 13:10

Pinned Comments

yurikoles commented on 2020-04-18 13:13

PRs are welcome:

Latest Comments

yurikoles commented on 2020-04-18 13:13

PRs are welcome:

yurikoles commented on 2020-04-18 13:11

@truko22 thanks for catching this! I had added cmake and ninja and had verified that it builds in clean chroot.

truko22 commented on 2020-04-16 17:27

You should add NINJA as a build dependency :D

yurikoles commented on 2020-03-24 06:38

Hi @sl1pkn07, Please check out

P.S. We really miss your kde-mac/kde contributions :(

sl1pkn07 commented on 2019-04-07 23:15

this package should be named grub2-editor-frameworks-git. or switch to release source (.tar.gz)

hellraise007 commented on 2018-05-16 17:00

error: failed retrieving file 'extra-cmake-modules-5.45.0-1-any.pkg.tar.xz' from multiple mirrors

pavbaranov commented on 2018-01-07 18:28

With imagemagick 7.0.7 it cannot be longer build. See:

Xeno_Idaltu commented on 2017-12-12 09:16

I recommend this app for newcommers who want easier access to settings while still learning how to do it from the command line. =)

pavbaranov commented on 2016-02-10 11:18

Variable in conflicts and provides (in PKGBUILD) should be a matrix (you forgot about brackets).

FadeMind commented on 2015-11-27 08:00

Failed build:

Last lines:

src/CMakeFiles/kcm_grub2.dir/build.make:170: recipe for target 'src/CMakeFiles/kcm_grub2.dir/convertDlg.o' failed
make[2]: *** [src/CMakeFiles/kcm_grub2.dir/convertDlg.o] Error 1
CMakeFiles/Makefile2:138: recipe for target 'src/CMakeFiles/kcm_grub2.dir/all' failed
make[1]: *** [src/CMakeFiles/kcm_grub2.dir/all] Error 2
Makefile:127: recipe for target 'all' failed
make: *** [all] Error 2