Package Details: granite-git 5.2.2.r15.c1d97d82-1

Git Clone URL: https://aur.archlinux.org/granite-git.git (read-only)
Package Base: granite-git
Description: Library that extends Gtk+
Upstream URL: https://github.com/elementary/granite
Licenses: LGPL3
Groups: pantheon-unstable
Conflicts: granite
Provides: granite, libgranite.so
Submitter: alucryd
Maintainer: alucryd
Last Packager: alucryd
Votes: 131
Popularity: 0.395011
First Submitted: 2017-04-30 15:13
Last Updated: 2019-02-01 15:23

Required by (214)

Sources (1)

Latest Comments

« First ‹ Previous 1 2 3 4

dserban commented on 2011-09-21 12:36

Disowning.

Unia commented on 2011-09-21 12:03

You need vala-git as a dependency. Here's my working PKGBUILD:

http://pastebin.com/7KSvuMPk

Unia commented on 2011-09-21 11:22

Here's an updated (and cleaner?) PKGBUILD that works. You need vala-git as dependency.

http://pastebin.com/R5sbifS6

Unia commented on 2011-09-20 21:47

Building fails with the following error message, can you help?


[ 0%] Generating Granite-0.1.typelib
[ 4%] Built target gir-typelibs
[ 8%] Generating Application.c, Drawing/Color.c, Drawing/BufferSurface.c, Drawing/Utilities.c, GtkPatch/AboutDialog.c, Services/Settings.c, Services/Logger.c, Services/Paths.c, Services/System.c, Widgets/AboutDialog.c, Widgets/ModeButton.c, Widgets/DatePicker.c, Widgets/Entries.c, Widgets/TimePicker.c, Widgets/CollapsiblePaned.c, Widgets/StaticNotebook.c, Widgets/CompositedWindow.c, Widgets/AppMenu.c, Widgets/Welcome.c, Widgets/ToolButtonWithMenu.c, config.vapi, granite.vapi, granite.h, granite_internal.h

** (valac:28115): CRITICAL **: vala_variable_get_variable_type: assertion `self != NULL' failed

** (valac:28115): CRITICAL **: vala_data_type_get_value_owned: assertion `self != NULL' failed
/tmp/packerbuild-1000/granite-bzr/granite-bzr/src/granite/lib/Widgets/ModeButton.vala:104.34-104.37: warning: Argument 2: Cannot pass null to non-null parameter type
mode_removed(number, null);
^^^^
/tmp/packerbuild-1000/granite-bzr/granite-bzr/src/granite/lib/Widgets/Entries.vala:32.19-32.70: error: invocation of void method not allowed as expression
normal_color = get_style_context().get_color(Gtk.StateFlags.NORMAL);
^^^^^^^^^^^^^^^^^^^^^^^^^^^^^^^^^^^^^^^^^^^^^^^^^^^^
/tmp/packerbuild-1000/granite-bzr/granite-bzr/src/granite/lib/Widgets/Entries.vala:33.24-33.80: error: invocation of void method not allowed as expression
insensitive_color = get_style_context().get_color(Gtk.StateFlags.INSENSITIVE);
^^^^^^^^^^^^^^^^^^^^^^^^^^^^^^^^^^^^^^^^^^^^^^^^^^^^^^^^^
Compilation failed: 2 error(s), 1 warning(s)
make[2]: *** [lib/Application.c] Fout 1
make[1]: *** [lib/CMakeFiles/granite.dir/all] Fout 2
make: *** [all] Fout 2
==> ERROR: A failure occurred in build().
Aborting...
The build failed.