Package Details: granite-git 5.2.2.r15.c1d97d82-1

Git Clone URL: https://aur.archlinux.org/granite-git.git (read-only)
Package Base: granite-git
Description: Library that extends Gtk+
Upstream URL: https://github.com/elementary/granite
Licenses: LGPL3
Groups: pantheon-unstable
Conflicts: granite
Provides: granite, libgranite.so
Submitter: alucryd
Maintainer: alucryd
Last Packager: alucryd
Votes: 131
Popularity: 0.366808
First Submitted: 2017-04-30 15:13
Last Updated: 2019-02-01 15:23

Required by (216)

Sources (1)

Latest Comments

« First ‹ Previous 1 2 3 4 Next › Last »

Ner0 commented on 2013-04-11 17:01

Just add the 'sed' line in the PKGBUILD:

http://aur.pastebin.com/373KcegN

ivenvd commented on 2013-04-11 15:29

Seems incompatible with libgee-0.10:

-- package 'gee-1.0' not found
CMake Error at /usr/share/cmake-2.8/Modules/FindPkgConfig.cmake:279 (message):
A required package was not found

xircon commented on 2013-04-09 07:38

Getting this error:
==> ERROR: There is no agent set up to handle bzr+https URLs. Check /etc/makepkg.conf.
How do I fix?

Anonymous comment on 2012-11-10 16:06

Hi, I am getting the following error while building granite-bzr for slingshot. The last few lines are as follows :

Linking C executable granite-demo
/usr/lib/gcc/x86_64-unknown-linux-gnu/4.7.2/../../../../lib/libgtk-3.so: undefined reference to `g_application_get_dbus_connection'
/usr/lib/gcc/x86_64-unknown-linux-gnu/4.7.2/../../../../lib/libgtk-3.so: undefined reference to `g_application_get_dbus_object_path'
collect2: error: ld returned 1 exit status
make[2]: *** [demo/granite-demo] Error 1
make[1]: *** [demo/CMakeFiles/granite-demo.dir/all] Error 2
make: *** [all] Error 2
==> ERROR: A failure occurred in build().
Aborting...
The build failed.

What can I do to rectify this?

Szunti commented on 2012-10-06 11:00

cd to the directory where the PKGBUILD is and

wget http://metal.elte.hu/~vandrus/granite-bzr.diff #to download the patch

then

patch -p1 < granite-bzr.diff

But it shouldn't change much, just there is one less non-fatal error at build, which can be ignored anyway. And if some icons won't show after install it will fix that.

sistematico commented on 2012-10-05 21:38

How to apply?

Szunti commented on 2012-06-16 19:07

I made a patch, which handle gtk-update-icon-cache: http://metal.elte.hu/~vandrus/granite-bzr.diff

Ner0 commented on 2012-05-01 22:44

What are your gtk3 and glib2 versions?

Also try changing the cmake line in PKGBUILD to

cmake .. -DCMAKE_INSTALL_PREFIX=/usr -DCMAKE_SHARED_LINKER_FLAGS="-fPIC"

paulbarbee commented on 2012-05-01 19:16

I get the following when I try to build this package:


Linking C shared library libgranite.so
/usr/bin/ld: /usr/lib/gcc/x86_64-unknown-linux-gnu/4.7.0/../../../../lib/libgtk-3.a(gtkaction.o): relocation R_X86_64_32S against `.text' can not be used when making a shared object; recompile with -fPIC
/usr/lib/gcc/x86_64-unknown-linux-gnu/4.7.0/../../../../lib/libgtk-3.a: could not read symbols: Bad value
collect2: error: ld returned 1 exit status
make[2]: *** [lib/libgranite.so.0.1.5] Error 1
make[1]: *** [lib/CMakeFiles/granite.dir/all] Error 2
make: *** [all] Error 2

Liquen commented on 2012-04-28 22:01

I believe libgee should be in the dependencies.